Ethyl 2-bromobenzoate
- Formula: C9H9BrO2
- Molecular weight: 229.071
- IUPAC Standard InChIKey: BIHHBTVQFPVSTE-UHFFFAOYSA-N
- CAS Registry Number: 6091-64-1
- Chemical structure:
View 3d structure (requires JavaScript / HTML 5) - Other names: Benzoic acid, 2-bromo-, ethyl ester; 2-Bromobezoic acid, ethyl ester

Phase change data

Data compiled by: Robert L. Brown and Stephen E. Stein
Quantity | Value | Units | Method | Reference | Comment |
---|---|---|---|---|---|
Tboil | 527.7 | K | N/A | Weast and Grasselli, 1989 | |
Tboil | 527. to 528. | K | N/A | Buckingham and Donaghy, 1982 |
Reduced pressure boiling point
Tboil (K) | Pressure (bar) | Reference |
---|---|---|
390.2 | 0.023 | Aldrich Chemical Company Inc., 1990 |
390. | 0.023 | Buckingham and Donaghy, 1982 |

References

Weast and Grasselli, 1989
CRC Handbook of Data on Organic Compounds, 2nd Editon, Weast,R.C and Grasselli, J.G., ed(s)., CRC Press, Inc., Boca Raton, FL, 1989, 1. [all data]
Buckingham and Donaghy, 1982
Buckingham, J.; Donaghy, S.M.,
Dictionary of Organic Compounds: Fifth Edition, Chapman and Hall, New York, 1982, 1. [all data]
Aldrich Chemical Company Inc., 1990
Aldrich Chemical Company Inc.,
Catalog Handbook of Fine Chemicals, Aldrich Chemical Company, Inc., Milwaukee WI, 1990, 1. [all data]