2-Cyclohexen-1-one, 3-methyl-6-(1-methylethyl)-, (S)-
- Formula: C10H16O
- Molecular weight: 152.2334
- IUPAC Standard InChIKey: YSTPAHQEHQSRJD-SECBINFHSA-N
- CAS Registry Number: 6091-50-5
- Chemical structure:
View 3d structure (requires JavaScript / HTML 5) - Stereoisomers:

Phase change data

Data compiled by: Robert L. Brown and Stephen E. Stein
Reduced pressure boiling point
Tboil (K) | Pressure (bar) | Reference |
---|---|---|
390.2 | 0.027 | Weast and Grasselli, 1989 |

References

Weast and Grasselli, 1989
CRC Handbook of Data on Organic Compounds, 2nd Editon, Weast,R.C and Grasselli, J.G., ed(s)., CRC Press, Inc., Boca Raton, FL, 1989, 1. [all data]