Propanedioic acid, methyl-, dimethyl ester
- Formula: C6H10O4
- Molecular weight: 146.1412
- IUPAC Standard InChIKey: LRBPFPZTIZSOGG-UHFFFAOYSA-N
- CAS Registry Number: 609-02-9
- Chemical structure:
View 3d structure (requires JavaScript / HTML 5) - Other names: Malonic acid, methyl-, dimethyl ester; Dimethyl methylmalonate; Propanedioic acid, 2-methyl-, dimethyl ester; Maleic acid, dimethyl ester

Gas phase thermochemistry data

Data compiled by: Hussein Y. Afeefy, Joel F. Liebman, and Stephen E. Stein
Quantity | Value | Units | Method | Reference | Comment |
---|---|---|---|---|---|
ΔfH°gas | -768.56 ± 0.88 | kJ/mol | Ccb | Verevkin, Dogan, et al., 1990 | see Verevkin, Beckhaus, et al., 1992 |

Condensed phase thermochemistry data

Data compiled as indicated in comments:
ALS - Hussein Y. Afeefy, Joel F. Liebman, and Stephen E. Stein
DH - Eugene S. Domalski and Elizabeth D. Hearing
Quantity | Value | Units | Method | Reference | Comment |
---|---|---|---|---|---|
ΔfH°liquid | -826.34 ± 0.54 | kJ/mol | Ccb | Verevkin, Dogan, et al., 1990 | see Verevkin, Beckhaus, et al., 1992; ALS |
Quantity | Value | Units | Method | Reference | Comment |
ΔcH°liquid | -2963.9 ± 0.54 | kJ/mol | Ccb | Verevkin, Dogan, et al., 1990 | see Verevkin, Beckhaus, et al., 1992; Corresponding ΔfHºliquid = -826.34 kJ/mol (simple calculation by NIST; no Washburn corrections); ALS |
Constant pressure heat capacity of liquid
Cp,liquid (J/mol*K) | Temperature (K) | Reference | Comment |
---|---|---|---|
261.7 | 298.15 | Verevkin, Beckhaus, et al., 1992 | DH |

Phase change data

Data compiled as indicated in comments:
BS - Robert L. Brown and Stephen E. Stein
ALS - Hussein Y. Afeefy, Joel F. Liebman, and Stephen E. Stein
DRB - Donald R. Burgess, Jr.
AC - William E. Acree, Jr., James S. Chickos
Quantity | Value | Units | Method | Reference | Comment |
---|---|---|---|---|---|
Tboil | 449.7 | K | N/A | Weast and Grasselli, 1989 | BS |
Quantity | Value | Units | Method | Reference | Comment |
ΔvapH° | 57.78 ± 0.71 | kJ/mol | C | Verevkin, Dogan, et al., 1990 | see Verevkin, Beckhaus, et al., 1992; ALS |
ΔvapH° | 57.8 | kJ/mol | N/A | Verevkin, Dogan, et al., 1990 | DRB |
Enthalpy of vaporization
ΔvapH (kJ/mol) | Temperature (K) | Method | Reference | Comment |
---|---|---|---|---|
57.8 ± 0.8 | 293. | GS | Verevkin, Beckhaus, et al., 1992 | Based on data from 278. to 308. K.; AC |

Van Den Dool and Kratz RI, non-polar column, custom temperature program

Column type | Active phase | I | Reference | Comment |
---|---|---|---|---|
Capillary | VF-5MS | 960.7 | Tret'yakov, 2007 | 30. m/0.25 mm/0.25 μm, He; Program: Multi-step temperature program; T(initial)=60C; T(final)=270C |

References

Verevkin, Dogan, et al., 1990
Verevkin, S.; Dogan, B.; Beckhaus, H.D.; Ruechardt, C.,
Geminal substituent effects. 3. Synergistic destablization by geminal ester groups,
Angew. Chem., 1990, 102, 693-695. [all data]
Verevkin, Beckhaus, et al., 1992
Verevkin, S.P.; Beckhaus, H.-D.; Ruchardt, C.,
Geminale substituenteneffekte Teil 5α. Standardbildungsenthalpien von alkylsubstituierten Malonsaure- und α-aminocarbonsaureestern,
Thermochim. Acta, 1992, 197, 27-39. [all data]
Weast and Grasselli, 1989
CRC Handbook of Data on Organic Compounds, 2nd Editon, Weast,R.C and Grasselli, J.G., ed(s)., CRC Press, Inc., Boca Raton, FL, 1989, 1. [all data]
Tret'yakov, 2007
Tret'yakov, K.V.,
Retention Data. NIST Mass Spectrometry Data Center., NIST Mass Spectrometry Data Center, 2007. [all data]