3-Methyluracil
- Formula: C5H6N2O2
- Molecular weight: 126.1133
- IUPAC Standard InChIKey: VPLZGVOSFFCKFC-UHFFFAOYSA-N
- CAS Registry Number: 608-34-4
- Chemical structure:
View 3d structure (requires JavaScript / HTML 5) - Permanent link for this species. Use this link for bookmarking this species for future reference.

Phase change data

Data compiled by: William E. Acree, Jr., James S. Chickos
Enthalpy of sublimation
ΔsubH (kJ/mol) | Temperature (K) | Method | Reference | Comment |
---|---|---|---|---|
118.8 ± 3.0 | 382. | TE | Brunetti, Piacente, et al., 2000 | Based on data from 344. to 419. K. |
75. ± 8. | 463. | HSA | Nowak, Szczepaniak, et al., 1978 | Based on data from 438. to 498. K. |

Reaction thermochemistry data

Data compiled by: John E. Bartmess
Individual Reactions
C5H5N2O2- + =
By formula: C5H5N2O2- + H+ = C5H6N2O2
Quantity | Value | Units | Method | Reference | Comment |
---|---|---|---|---|---|
ΔrH° | 1519. ± 13. | kJ/mol | IMRB | Lee, 2005 | gas phase |

Gas phase ion energetics data

Data compiled by: John E. Bartmess
De-protonation reactions
C5H5N2O2- + =
By formula: C5H5N2O2- + H+ = C5H6N2O2
Quantity | Value | Units | Method | Reference | Comment |
---|---|---|---|---|---|
ΔrH° | 1519. ± 13. | kJ/mol | IMRB | Lee, 2005 | gas phase |

References

Brunetti, Piacente, et al., 2000
Brunetti, Bruno; Piacente, Vincenzo; Portalone, Gustavo,
Sublimation Enthalpies of Some Methyl Derivatives of Uracil from Vapor Pressure Measurements,
J. Chem. Eng. Data, 2000, 45, 2, 242-246, https://doi.org/10.1021/je9902802
. [all data]
Nowak, Szczepaniak, et al., 1978
Nowak, M.J.; Szczepaniak, K.; Barski, A.; Shugar, D.Z.,
Z. Naturforsch. C, 1978, 33C, 876. [all data]
Lee, 2005
Lee, J.K.,
Insights into nucleic acid reactivity through gas-phase experimental and computational studies,
Int. J. Mass Spectrom., 2005, 240, 3, 261-272, https://doi.org/10.1016/j.ijms.2004.09.020
. [all data]
Shugar and Fox, 1952
Shugar, D.; Fox, J.J.,
Biochim. et Biophys. Acta, 1952, 9, 199. [all data]