Benzoic acid, 2-methyl-, anhydride
- Formula: C16H14O3
- Molecular weight: 254.2806
- IUPAC Standard InChIKey: YLBSXJWDERHYFY-UHFFFAOYSA-N
- CAS Registry Number: 607-86-3
- Chemical structure:

Condensed phase thermochemistry data

Data compiled by: Hussein Y. Afeefy, Joel F. Liebman, and Stephen E. Stein
Quantity | Value | Units | Method | Reference | Comment |
---|---|---|---|---|---|
ΔfH°solid | -533.5 ± 7.9 | kJ/mol | Ccb | Breitenbach and Derkosch, 1951 | Reanalyzed by Cox and Pilcher, 1970, Original value = -532.6 kJ/mol |
Quantity | Value | Units | Method | Reference | Comment |
ΔcH°solid | -7763.4 ± 7.9 | kJ/mol | Ccb | Breitenbach and Derkosch, 1951 | Reanalyzed by Cox and Pilcher, 1970, Original value = -7763.0 kJ/mol; Corresponding ΔfHºsolid = -533.54 kJ/mol (simple calculation by NIST; no Washburn corrections) |

References

Breitenbach and Derkosch, 1951
Breitenbach, J.W.; Derkosch, J.,
Verbrennungswarmen von peroxyden und verwandten verbindungen sowie von polystrolen,
Monatsh. Chem., 1951, 82, 177-179. [all data]
Cox and Pilcher, 1970
Cox, J.D.; Pilcher, G.,
Thermochemistry of Organic and Organometallic Compounds, Academic Press, New York, 1970, 1-636. [all data]