bis(phenylethynyl)mercury
- Formula: C16H10Hg
- Molecular weight: 402.84
- CAS Registry Number: 6077-10-7

Condensed phase thermochemistry data

Data compiled by: José A. Martinho Simões
Quantity | Value | Units | Method | Reference | Comment |
---|---|---|---|---|---|
ΔfH°solid | 621.3 ± 5.2 | kJ/mol | Review | Martinho Simões | |
Quantity | Value | Units | Method | Reference | Comment |
ΔcH°solid | -8346.6 ± 4.8 | kJ/mol | CC-SB | Carson and Spencer, 1984 |

Phase change data

Data compiled as indicated in comments:
MS - José A. Martinho Simões
AC - William E. Acree, Jr., James S. Chickos
Quantity | Value | Units | Method | Reference | Comment |
---|---|---|---|---|---|
ΔsubH° | 99.2 ± 1.4 | kJ/mol | CC-SB | Carson and Spencer, 1984 | MS |
Enthalpy of sublimation
ΔsubH (kJ/mol) | Temperature (K) | Method | Reference | Comment |
---|---|---|---|---|
99.2 ± 1.4 | 350. to 390. | ME,TE | Carson and Spencer, 1984, 2 | AC |

Gas phase thermochemistry data

Data compiled by: José A. Martinho Simões
Quantity | Value | Units | Method | Reference | Comment |
---|---|---|---|---|---|
ΔfH°gas | 720.5 ± 5.4 | kJ/mol | Review | Martinho Simões |

References

Martinho Simões
Martinho Simões, J.A.,
Private communication (see http://webbook.nist.gov/chemistry/om/). [all data]
Carson and Spencer, 1984
Carson, A.S.; Spencer, J.A.,
J. Chem. Thermodyn., 1984, 16, 423. [all data]
Carson and Spencer, 1984, 2
Carson, A.S.; Spencer, J.A.,
The enthalpies of formation of bis-benzyl mercury and bis-phenylethynyl mercury and some associated bond-dissociation enthalpies,
The Journal of Chemical Thermodynamics, 1984, 16, 5, 423-426, https://doi.org/10.1016/0021-9614(84)90197-6
. [all data]