9H-Fluorene, 2-nitro-
- Formula: C13H9NO2
- Molecular weight: 211.2161
- IUPAC Standard InChIKey: XFOHWECQTFIEIX-UHFFFAOYSA-N
- CAS Registry Number: 607-57-8
- Chemical structure:
- Other names: Fluorene, 2-nitro-; 2-Nitrofluorene; 2-Nitro-9H-fluorene

Phase change data

Data compiled by: William E. Acree, Jr., James S. Chickos
Enthalpy of sublimation
ΔsubH (kJ/mol) | Temperature (K) | Method | Reference |
---|---|---|---|
114.2 ± 3.0 | 349. to 384. | ME | Goldfarb and Suuberg, 2008 |

Van Den Dool and Kratz RI, non-polar column, temperature ramp

Column type | Active phase | I | Reference | Comment |
---|---|---|---|---|
Capillary | SE-30 | 2102. | Korhonen and Lind, 1985 | N2, 10. K/min; Column length: 25. m; Column diameter: 0.33 mm; Tstart: 100. C; Tend: 320. C |
Capillary | SE-30 | 2087. | Korhonen and Lind, 1985 | N2, 6. K/min; Column length: 25. m; Column diameter: 0.33 mm; Tstart: 140. C; Tend: 320. C |

Normal alkane RI, non-polar column, isothermal

Column type | Active phase | Temperature (C) | I | Reference | Comment |
---|---|---|---|---|---|
Capillary | SE-30 | 200. | 2066. | Korhonen and Lind, 1985 | N2; Column length: 25. m; Column diameter: 0.33 mm |

Normal alkane RI, non-polar column, custom temperature program

Column type | Active phase | I | Reference | Comment |
---|---|---|---|---|
Capillary | OV-1, SE-30, Methyl silicone, SP-2100, OV-101, DB-1, etc. | 2102. | Waggott and Davies, 1984 | Hydrogen; Column length: 50. m; Column diameter: 0.32 mm; Program: not specified |

Lee's RI, non-polar column, temperature ramp

Column type | Active phase | I | Reference | Comment |
---|---|---|---|---|
Capillary | HP-5 | 351.77 | Pedersen, Durant, et al., 2005 | 30. m/0.25 mm/0.25 μm, Helium, 50. C @ 1.5 min, 6. K/min, 310. C @ 10. min |
Capillary | DB-5 | 350.98 | Helmig and Arey, 1991 | 60. m/0.24 mm/0.25 μm, 6. K/min; Tstart: 50. C; Tend: 280. C |
Capillary | SE-52 | 353.06 | Boenke and Ballschmiter, 1987 | Hydrogen, 3. K/min; Column length: 12. m; Tstart: 120. C; Tend: 285. C |
Capillary | SE-52 | 352.17 | White, Robbat, et al., 1983 | 30. m/0.3 mm/0.25 μm, He, 4. K/min; Tstart: 25. C; Tend: 295. C |
Capillary | SE-52 | 352.12 | White, Robbat, et al., 1983 | 30. m/0.2 mm/0.25 μm, He, 4. K/min; Tstart: 25. C; Tend: 295. C |
Capillary | SE-52 | 352.22 | White, Robbat, et al., 1983 | 30. m/0.3 mm/0.25 μm, He, 4. K/min; Tstart: 100. C; Tend: 300. C |
Capillary | SE-52 | 352.60 | White, Robbat, et al., 1983 | 30. m/0.3 mm/0.25 μm, He, 4. K/min; Tstart: 40. C; Tend: 300. C |
Capillary | SE-52 | 352.42 | White, Robbat, et al., 1983 | 30. m/0.3 mm/0.25 μm, He, 4. K/min; Tstart: 70. C; Tend: 300. C |
Capillary | SE-52 | 353.06 | Vassilaros, Kong, et al., 1982 | 20. m/0.30 mm/0.25 μm, H2, 40. C @ 2. min, 4. K/min; Tend: 265. C |

Lee's RI, non-polar column, custom temperature program

Column type | Active phase | I | Reference | Comment |
---|---|---|---|---|
Capillary | OV-101 | 359.1 | Tucminen, Wickstrom, et al., 1986 | Program: not specified |

References

Goldfarb and Suuberg, 2008
Goldfarb, Jillian L.; Suuberg, Eric M.,
VAPOR PRESSURES AND THERMODYNAMICS OF OXYGEN-CONTAINING POLYCYCLIC AROMATIC HYDROCARBONS MEASURED USING KNUDSEN EFFUSION,
Environ Toxicol Chem, 2008, 27, 6, 1244, https://doi.org/10.1897/07-486.1
. [all data]
Korhonen and Lind, 1985
Korhonen, I.O.O.; Lind, M.A.,
Gas-liquid chromatographic analyses. XXXIV. Separation and retention indices with retention increments of some nitrated polynuclear aromatic hydrocarbons on a low-polarity (SE-30) capillary column,
J. Chromatogr., 1985, 322, 71-81, https://doi.org/10.1016/S0021-9673(01)97660-5
. [all data]
Waggott and Davies, 1984
Waggott, A.; Davies, I.W.,
Identification of organic pollutants using linear temperature programmed retention indices (LTPRIs) - Part II, 1984, retrieved from http://dwi.defra.gov.uk/research/completed-research/reports/dwi0383.pdf. [all data]
Pedersen, Durant, et al., 2005
Pedersen, D.U.; Durant, J.L.; Taghizadeh, K.; Hemond, H.F.; Lafleur, A.L.; Cass, G.R.,
Human cell mutagenes in respirable airborne particles from the Northeastern United States. 2. Quantification of mutagenes and other organic compounds.,
Environ. Sci. Technol., 2005, 39, 24, 9547-9560, https://doi.org/10.1021/es050886c
. [all data]
Helmig and Arey, 1991
Helmig, D.; Arey, J.,
Analytical chemistry of airborne nitrofluorenes,
Int. J. Environ. Anal. Chem., 1991, 43, 4, 219-233, https://doi.org/10.1080/03067319108027526
. [all data]
Boenke and Ballschmiter, 1987
Boenke, A.; Ballschmiter, K.,
Fused quinones as retention index marker in high resolution gas chromatography with electron-capture detection (HRGC/ECD) of oxidized aromatic compounds,
Fresenius J. Anal. Chem., 1987, 327, 1, 44-45, https://doi.org/10.1007/BF00474554
. [all data]
White, Robbat, et al., 1983
White, C.M.; Robbat, A., Jr.; Hoes, R.M.,
Gas chromatographic retention characteristics of nitrated polycyclic aromatic hydrocarbons on SE-52,
Chromatographia, 1983, 17, 11, 605-612, https://doi.org/10.1007/BF02261944
. [all data]
Vassilaros, Kong, et al., 1982
Vassilaros, D.L.; Kong, R.C.; Later, D.W.; Lee, M.L.,
Linear retention index system for polycyclic aromatic compounds. Critical evaluation and additional indices,
J. Chromatogr., 1982, 252, 1-20, https://doi.org/10.1016/S0021-9673(01)88394-1
. [all data]
Tucminen, Wickstrom, et al., 1986
Tucminen, A.; Wickstrom, K.; Pyysalo, H.,
Determination of Polycyclic Aromatic Compounds by GLC-Selected Ion Monitoring (SIM) Technique,
J. Hi. Res. Chromatogr. Chromatogr. Comm., 1986, 9, 8, 469-471, https://doi.org/10.1002/jhrc.1240090813
. [all data]