tantalum(5+) ethanolate
- Formula: C10H25O5Ta
- Molecular weight: 406.2504
- CAS Registry Number: 6074-84-6

Condensed phase thermochemistry data

Data compiled by: José A. Martinho Simões
Quantity | Value | Units | Method | Reference | Comment |
---|---|---|---|---|---|
ΔfH°liquid | -1640.2 ± 3.2 | kJ/mol | Review | Martinho Simões | |
Quantity | Value | Units | Method | Reference | Comment |
ΔcH°liquid | -6892.3 ± 2.1 | kJ/mol | CC-SB | Tel'noi, Rabinovich, et al., 1972 | Please also see Tel'noi and Rabinovich, 1977. |

Phase change data

Data compiled by: José A. Martinho Simões
Quantity | Value | Units | Method | Reference | Comment |
---|---|---|---|---|---|
ΔvapH° | 79.1 ± 8.4 | kJ/mol | CC-SB | Tel'noi, Rabinovich, et al., 1972 |

Gas phase thermochemistry data

Data compiled by: José A. Martinho Simões
Quantity | Value | Units | Method | Reference | Comment |
---|---|---|---|---|---|
ΔfH°gas | -373.1 ± 2.2 | kcal/mol | Review | Martinho Simões |

References

Martinho Simões
Martinho Simões, J.A.,
Private communication (see http://webbook.nist.gov/chemistry/om/). [all data]
Tel'noi, Rabinovich, et al., 1972
Tel'noi, V.I.; Rabinovich, I.B.; Kozyrkin, B.I.; Salamantin, B.A.; Kir'yanov, K.V.,
Dokl. Akad. Nauk SSSR, 1972, 205, 2, 364. [all data]
Tel'noi and Rabinovich, 1977
Tel'noi, V.I.; Rabinovich, I.B.,
Russ. Chem. Rev., 1977, 46, 689. [all data]