Cyclohexane, 1-methyl-4-(1-methylethyl)-, cis-
- Formula: C10H20
- Molecular weight: 140.2658
- IUPAC Standard InChIKey: CFJYNSNXFXLKNS-AOOOYVTPSA-N
- CAS Registry Number: 6069-98-3
- Chemical structure:
View 3d structure (requires JavaScript / HTML 5) - Stereoisomers:
- Other names: p-Menthane, cis-; cis-p-Menthane; 1-Isopropyl-cis-4-methylcyclohexane; 1-Methyl-cis-4-isopropylcyclohexane; cis-1-Methyl-4-isopropylcyclohexane; p-Menthane, Z-; 1-Isopropyl-4-methyl-cyclohexane, cis; 1-Methyl-4-(1-methylethyl)-cyclohexane, cis; cis-1-Isopropyl-4-methylcyclohexane

Kovats' RI, non-polar column, isothermal

Column type | Active phase | Temperature (C) | I | Reference | Comment |
---|---|---|---|---|---|
Capillary | SE-30 | 80. | 989.9 | Albaigés and Guardino, 1980 | He; Column length: 64. m; Column diameter: 0.25 mm |
Capillary | Squalane | 80. | 994.7 | Albaigés and Guardino, 1980 | He; Column length: 100. m; Column diameter: 0.25 mm |
Capillary | Apiezon L | 100. | 1018. | Morishita, Okano, et al., 1980 | Column length: 45. m; Column diameter: 0.25 mm |
Capillary | Squalane | 100. | 973. | Mitra, Mohan, et al., 1974 | H2; Column length: 50. m; Column diameter: 0.2 mm |
Packed | Apiezon L | 130. | 1027. | Paris and Alexandre, 1972 | Chromosorb W AW |
Packed | SE-30 | 130. | 1000. | Mitra and Saha, 1970 | N2 |
Packed | Squalane | 86. | 998. | Hively and Hinton, 1968 | He, Chromosorb P; Column length: 15. m; Column diameter: 0.25 mm |
Packed | Methyl Silicone | 130. | 1000. | Antheaume and Guiochon, 1965 |

Kovats' RI, non-polar column, temperature ramp

Column type | Active phase | I | Reference | Comment |
---|---|---|---|---|
Capillary | OV-101 | 984. | Hayes and Pitzer, 1982 | 110. m/0.25 mm/0.20 μm, He, 1. K/min; Tstart: 35. C; Tend: 200. C |
Capillary | Apiezon L | 1011. | Louis, 1971 | N2, 1. K/min; Column length: 50. m; Column diameter: 0.25 mm; Tstart: 60. C |

Kovats' RI, polar column, isothermal

Column type | Active phase | Temperature (C) | I | Reference | Comment |
---|---|---|---|---|---|
Capillary | PEG-20M | 100. | 1058. | Morishita, Okano, et al., 1980 | Column length: 75. m; Column diameter: 0.25 mm |

Van Den Dool and Kratz RI, non-polar column, temperature ramp

Column type | Active phase | I | Reference | Comment |
---|---|---|---|---|
Capillary | Petrocol DH | 988. | White, Hackett, et al., 1992 | 100. m/0.25 mm/0.5 μm, He, 1. K/min; Tstart: 30. C; Tend: 220. C |
Capillary | OV-101 | 984. | Hayes and Pitzer, 1981 | 108. m/0.25 mm/0.2 μm, 1. K/min; Tstart: 35. C; Tend: 200. C |

Normal alkane RI, non-polar column, temperature ramp

Column type | Active phase | I | Reference | Comment |
---|---|---|---|---|
Capillary | Petrocol DH | 989. | Supelco, 2012 | 100. m/0.25 mm/0.50 μm, Helium, 20. C @ 15. min, 15. K/min, 220. C @ 30. min |

Normal alkane RI, non-polar column, custom temperature program

Column type | Active phase | I | Reference | Comment |
---|---|---|---|---|
Capillary | Methyl Silicone | 991. | Zenkevich, 2000 | Program: not specified |

Phase change data

Data compiled as indicated in comments:
TRC - Thermodynamics Research Center, NIST Boulder Laboratories, Chris Muzny director
BS - Robert L. Brown and Stephen E. Stein
Quantity | Value | Units | Method | Reference | Comment |
---|---|---|---|---|---|
Tboil | 445.92 | K | N/A | Anonymous, 1953 | Uncertainty assigned by TRC = 0.3 K; TRC |
Quantity | Value | Units | Method | Reference | Comment |
Tfus | 183.28 | K | N/A | Streiff, Hulme, et al., 1955 | Uncertainty assigned by TRC = 0.09 K; TRC |
Tfus | 183.3 | K | N/A | Streiff, Hulme, et al., 1955 | Uncertainty assigned by TRC = 0.06 K; TRC |
Tfus | 183.35 | K | N/A | Streiff, Hulme, et al., 1955 | Uncertainty assigned by TRC = 0.04 K; TRC |
Reduced pressure boiling point
Tboil (K) | Pressure (bar) | Reference | Comment |
---|---|---|---|
444.1 | 0.967 | Weast and Grasselli, 1989 | BS |

References

Albaigés and Guardino, 1980
Albaigés, J.; Guardino, X.,
Gas chromatographic-mass spectrometric identification of alkylcyclohexanes and cyclohexenes,
Chromatographia, 1980, 13, 12, 755-762, https://doi.org/10.1007/BF02265555
. [all data]
Morishita, Okano, et al., 1980
Morishita, F.; Okano, T.; Kojima, T.,
Retention indices of monocyclic monoterpene hydrocarbons,
Bunseki Kagaku, 1980, 29, 1, 48-53, https://doi.org/10.2116/bunsekikagaku.29.48
. [all data]
Mitra, Mohan, et al., 1974
Mitra, G.D.; Mohan, G.; Sinha, A.,
Gas chromatographic analysis of complex hydrocarbon mixtures,
J. Chromatogr. A, 1974, 91, 633-648, https://doi.org/10.1016/S0021-9673(01)97944-0
. [all data]
Paris and Alexandre, 1972
Paris, C.; Alexandre, P.,
Stereochemical Investigation of Cyclohexane and Terpene Compounds by Gas Chromatography,
J. Chromatogr. Sci., 1972, 10, 6, 402-411, https://doi.org/10.1093/chromsci/10.6.402
. [all data]
Mitra and Saha, 1970
Mitra, G.D.; Saha, N.C.,
Determination of Retention Indices of Saturated Hydrocarbons by Graphical Methods,
J. Chromatogr. Sci., 1970, 8, 2, 95-102, https://doi.org/10.1093/chromsci/8.2.95
. [all data]
Hively and Hinton, 1968
Hively, R.A.; Hinton, R.E.,
Variation of the retention index with temperature on squalane substrates,
J. Gas Chromatogr., 1968, 6, 4, 203-217, https://doi.org/10.1093/chromsci/6.4.203
. [all data]
Antheaume and Guiochon, 1965
Antheaume, J.; Guiochon, G.,
Application de la chromatographie en phase gazeuse à l'étude de la composition des fractions moyennes d'un brut pétrolier,
Bull. Soc. Chim. Fr., 1965, 2, 298-307. [all data]
Hayes and Pitzer, 1982
Hayes, P.C., Jr.; Pitzer, E.W.,
Characterizing petroleum- and shale-derived jet fuel distillates via temperature-programmed Kováts indices,
J. Chromatogr., 1982, 253, 179-198, https://doi.org/10.1016/S0021-9673(01)88376-X
. [all data]
Louis, 1971
Louis, R.,
Kovats-index-tafeln zur gaschromatographischen analyse von kohlenwasserstoffgemischen,
Erdoel Kohle Erdgas Petrochem., 1971, 24, 2, 88-94. [all data]
White, Hackett, et al., 1992
White, C.M.; Hackett, J.; Anderson, R.R.; Kail, S.; Spock, P.S.,
Linear temperature programmed retention indices of gasoline range hydrocarbons and chlorinated hydrocarbons on cross-linked polydimethylsiloxane,
J. Hi. Res. Chromatogr., 1992, 15, 2, 105-120, https://doi.org/10.1002/jhrc.1240150211
. [all data]
Hayes and Pitzer, 1981
Hayes, P.C., Jr.; Pitzer, E.W.,
Kovats indices as a tool in characterizing hydrocarbon fuels in temperature programmed glass capillary gas chromatography. Part 1. Qualitative identification, Inhouse rpt. for Air Force Wright Aeronautical Labs., Air Force Wright Aeronautical Labs., Wright-Patterson AFB, Ohio, 1981, 75. [all data]
Supelco, 2012
Supelco, CatalogNo. 24160-U,
Petrocol DH Columns. Catalog No. 24160-U, 2012, retrieved from http://www.sigmaaldrich.com/etc/medialib/docs/Supelco/Datasheet/1/w97949.Par.0001.File.tmp/w97949.pdf. [all data]
Zenkevich, 2000
Zenkevich, I.G.,
Mutual Correlation between Gas Chromatographic Retention Indices of Unsaturated and Saturated Hydrocarbons found by Molecular Dynamics,
Z. Anal. Chem., 2000, 55, 10, 1091-1097. [all data]