diethyl(propan-2-olato)aluminium
- Formula: C7H17AlO
- Molecular weight: 144.1908
- CAS Registry Number: 6063-60-1

Condensed phase thermochemistry data

Data compiled by: José A. Martinho Simões
Quantity | Value | Units | Method | Reference | Comment |
---|---|---|---|---|---|
ΔfH°liquid | -654. ± 14. | kJ/mol | Review | Martinho Simões | |
Quantity | Value | Units | Method | Reference | Comment |
ΔcH°liquid | -5368. ± 14. | kJ/mol | CC-SB | Shmyreva, Golosova, et al., 1974 | Please also see Pedley and Rylance, 1977. |

Phase change data

Data compiled by: José A. Martinho Simões
Quantity | Value | Units | Method | Reference | Comment |
---|---|---|---|---|---|
ΔvapH° | 50.9 ± 0.8 | kJ/mol | CC-SB | Shmyreva, Golosova, et al., 1974 |

Gas phase thermochemistry data

Data compiled by: José A. Martinho Simões
Quantity | Value | Units | Method | Reference | Comment |
---|---|---|---|---|---|
ΔfH°gas | -144.1 ± 3.4 | kcal/mol | Review | Martinho Simões |

References

Martinho Simões
Martinho Simões, J.A.,
Private communication (see http://webbook.nist.gov/chemistry/om/). [all data]
Shmyreva, Golosova, et al., 1974
Shmyreva, G.O.; Golosova, R.M.; Sakharovskaya, G.B.; Popov, A.F.; Korneev, N.N.; Smolyaninova, A.A.,
Russ. J. Phys. Chem., 1974, 48, 447. [all data]
Pedley and Rylance, 1977
Pedley, J.B.; Rylance, J.,
Computer Analysed Thermochemical Data: Organic and Organometallic Compounds, University of Sussex, Brigton, 1977. [all data]