2-Methoxy-1,3,5-trinitro-benzene
- Formula: C7H5N3O7
- Molecular weight: 243.1305
- IUPAC Standard InChIKey: FMXDVBRYDYFVGS-UHFFFAOYSA-N
- CAS Registry Number: 606-35-9
- Chemical structure:
View 3d structure (requires JavaScript / HTML 5) - Permanent link for this species. Use this link for bookmarking this species for future reference.

Condensed phase thermochemistry data

Data compiled by: Hussein Y. Afeefy, Joel F. Liebman, and Stephen E. Stein
Quantity | Value | Units | Method | Reference | Comment |
---|---|---|---|---|---|
ΔfH°solid | -187.2 | kJ/mol | Ccb | Rinkenbach, 1930 | Author hf298_condensed[kcal/mol]=-47.40 |
Quantity | Value | Units | Method | Reference | Comment |
ΔcH°solid | -3310.1 ± 3.3 | kJ/mol | Ccb | Badoche, 1942 | Reanalyzed by Cox and Pilcher, 1970, Original value = -3316.9 kJ/mol |
ΔcH°solid | -3310.1 ± 3.3 | kJ/mol | Ccb | Burlot, 1939 | Reanalyzed by Cox and Pilcher, 1970, Original value = -3325.7 kJ/mol |
ΔcH°solid | -3281.93 | kJ/mol | Ccb | Rinkenbach, 1930 | Author hf298_condensed[kcal/mol]=-47.40 |

Phase change data

Data compiled by: William E. Acree, Jr., James S. Chickos
Enthalpy of vaporization
ΔvapH (kJ/mol) | Temperature (K) | Method | Reference | Comment |
---|---|---|---|---|
91.9 | 352. | A | Stephenson and Malanowski, 1987 | Based on data from 342. to 363. K. |
Enthalpy of sublimation
ΔsubH (kJ/mol) | Temperature (K) | Method | Reference | Comment |
---|---|---|---|---|
132.4 | 338. | A | Stephenson and Malanowski, 1987 | Based on data from 334. to 342. K. |

References

Rinkenbach, 1930
Rinkenbach, W.H.,
The heats of combustion and formation of aromatic nitro compounds,
J. Am. Chem. Soc., 1930, 52, 115-120. [all data]
Badoche, 1942
Badoche, M.,
Chaleurs de combustion de derives nitres phenoliques,
Bull. Soc. Chim. France, 1942, 9, 86-95. [all data]
Cox and Pilcher, 1970
Cox, J.D.; Pilcher, G.,
Thermochemistry of Organic and Organometallic Compounds, Academic Press, New York, 1970, 1-636. [all data]
Burlot, 1939
Burlot, E.,
Etude relative a la calorimetrie des explosifs,
Mem. Poudres, 1939, 29, 226-260. [all data]
Stephenson and Malanowski, 1987
Stephenson, Richard M.; Malanowski, Stanislaw,
Handbook of the Thermodynamics of Organic Compounds, 1987, https://doi.org/10.1007/978-94-009-3173-2
. [all data]