2,4,6-trinitrobenzaldehyde
- Formula: C7H3N3O7
- Molecular weight: 241.1146
- IUPAC Standard InChIKey: HWFUMAYINFTNSZ-UHFFFAOYSA-N
- CAS Registry Number: 606-34-8
- Chemical structure:
View 3d structure (requires JavaScript / HTML 5) - Other names: Benzaldehyde, 2,4,6-trinitro-

Condensed phase thermochemistry data

Data compiled by: Hussein Y. Afeefy, Joel F. Liebman, and Stephen E. Stein
Quantity | Value | Units | Method | Reference | Comment |
---|---|---|---|---|---|
ΔfH°solid | -132.8 | kJ/mol | Ccb | Rinkenbach, 1930 | Author hf298_condensed[kcal/mol]=-34.29 |
Quantity | Value | Units | Method | Reference | Comment |
ΔcH°solid | -3050.58 | kJ/mol | Ccb | Rinkenbach, 1930 | Author hf298_condensed[kcal/mol]=-34.29 |

References

Rinkenbach, 1930
Rinkenbach, W.H.,
The heats of combustion and formation of aromatic nitro compounds,
J. Am. Chem. Soc., 1930, 52, 115-120. [all data]