1-Chloro-2,6-dinitrobenzene
- Formula: C6H3ClN2O4
- Molecular weight: 202.552
- IUPAC Standard InChIKey: BPPMIQPXQVIZNJ-UHFFFAOYSA-N
- CAS Registry Number: 606-21-3
- Chemical structure:
View 3d structure (requires JavaScript / HTML 5) - Other names: Benzene, 2-chloro-1,3-dinitro-; 1,3-Dinitro-2-chlorobenzene; 2-Chloro-1,3-dinitrobenzene; 2-Chloro-1,3-dintrobenzene; 2,6-Dinitrochlorobenzene

Phase change data

Data compiled by: William E. Acree, Jr., James S. Chickos
Enthalpy of fusion
ΔfusH (kJ/mol) | Temperature (K) | Reference |
---|---|---|
18.95 | 361.2 | Kubota, 1932 |

References

Kubota, 1932
Kubota, T.,
J. Chem. Soc. Jpn., 1932, 53, 404. [all data]