2,5-Cyclohexadiene-1,4-dione, 2,3-dimethoxy-5-methyl-
- Formula: C9H10O4
- Molecular weight: 182.1733
- IUPAC Standard InChIKey: UIXPTCZPFCVOQF-UHFFFAOYSA-N
- CAS Registry Number: 605-94-7
- Chemical structure:

Gas phase ion energetics data

Data compiled by: John E. Bartmess
Electron affinity determinations
EA (eV) | Method | Reference | Comment |
---|---|---|---|
1.856 ± 0.061 | TDEq | Heinis, Chowdhury, et al., 1988 | ΔGea=-40.8 kcal/mol; ΔSea=-4.0 eu |

References

Heinis, Chowdhury, et al., 1988
Heinis, T.; Chowdhury, S.; Scott, S.L.; Kebarle, P.,
Electron Affinities of Benzo-, Naphtho-, and Anthraquinones Determined from Gas-Phase Equilibria Measurements,
J. Am. Chem. Soc., 1988, 110, 2, 400, https://doi.org/10.1021/ja00210a015
. [all data]