Naphthalene, 1,5-dinitro-
- Formula: C10H6N2O4
- Molecular weight: 218.1656
- IUPAC Standard InChIKey: ZUTCJXFCHHDFJS-UHFFFAOYSA-N
- CAS Registry Number: 605-71-0
- Chemical structure:
- Other names: 1,5-Dinitronaphthalene

Condensed phase thermochemistry data

Data compiled as indicated in comments:
ALS - Hussein Y. Afeefy, Joel F. Liebman, and Stephen E. Stein
DH - Eugene S. Domalski and Elizabeth D. Hearing
Quantity | Value | Units | Method | Reference | Comment |
---|---|---|---|---|---|
ΔfH°solid | 33.6 ± 7.1 | kJ/mol | Ccb | Medard and Thomas, 1955 | Reanalyzed by Cox and Pilcher, 1970, Original value = 38. kJ/mol; ALS |
ΔfH°solid | 38.4 | kJ/mol | Ccb | Rinkenbach, 1930 | Author hf298_condensed[kcal/mol]=5.44; ALS |
Quantity | Value | Units | Method | Reference | Comment |
ΔcH°solid | -4826.2 ± 7.1 | kJ/mol | Ccb | Medard and Thomas, 1955 | Reanalyzed by Cox and Pilcher, 1970, Original value = -4830.8 kJ/mol; ALS |
ΔcH°solid | -4820.4 ± 5.0 | kJ/mol | Ccb | Badoche, 1937 | Reanalyzed by Cox and Pilcher, 1970, Original value = -4821.71 kJ/mol; ALS |
ΔcH°solid | -4831.01 | kJ/mol | Ccb | Rinkenbach, 1930 | Author hf298_condensed[kcal/mol]=5.44; ALS |
Constant pressure heat capacity of solid
Cp,solid (J/mol*K) | Temperature (K) | Reference | Comment |
---|---|---|---|
259.4 | 323. | Satoh and Sogabe, 1941 | T = 0 to 100°C. Mean value.; DH |

Phase change data

Data compiled by: William E. Acree, Jr., James S. Chickos
Enthalpy of vaporization
ΔvapH (kJ/mol) | Temperature (K) | Method | Reference | Comment |
---|---|---|---|---|
74.7 | 521. | A | Stephenson and Malanowski, 1987 | Based on data from 506. to 642. K. |

Gas phase ion energetics data

Data compiled by: John E. Bartmess
Electron affinity determinations
EA (eV) | Method | Reference | Comment |
---|---|---|---|
1.77 ± 0.10 | IMRE | Heinis, Chowdhury, et al., 1993 | ΔGea(423 K)= -39.3 kcal/mol , ΔSea=-3.2 (entropy estimated) |
<2.250 ± 0.050 | PD | Mock and Grimsrud, 1989 |

References

Medard and Thomas, 1955
Medard, L.; Thomas, M.,
Chaleurs de combustion de treize substances explosives ou apparentees a des explosifs,
Mem. Poudres, 1955, 38, 46-63. [all data]
Cox and Pilcher, 1970
Cox, J.D.; Pilcher, G.,
Thermochemistry of Organic and Organometallic Compounds, Academic Press, New York, 1970, 1-636. [all data]
Rinkenbach, 1930
Rinkenbach, W.H.,
The heats of combustion and formation of aromatic nitro compounds,
J. Am. Chem. Soc., 1930, 52, 115-120. [all data]
Badoche, 1937
Badoche, M.,
Determinations de la chaleur de combustion de quelques derives nitres du naphtalene,
Bull. Soc. Chim. France, 1937, 4, 549-557. [all data]
Satoh and Sogabe, 1941
Satoh, S.; Sogabe, T.,
The heat capacities of some organic compounds containing nitrogen and the atomic heat of nitrogen. (4), Sci.,
Pap. Inst. Phys. Chem. Res. (Tokyo), 1941, 38, 246-251. [all data]
Stephenson and Malanowski, 1987
Stephenson, Richard M.; Malanowski, Stanislaw,
Handbook of the Thermodynamics of Organic Compounds, 1987, https://doi.org/10.1007/978-94-009-3173-2
. [all data]
Heinis, Chowdhury, et al., 1993
Heinis, T.; Chowdhury, S.; Kebarle, P.,
Electron Affinities of Naphthalene, Anthracene and Substituted Naphthalenes and Anthracenes,
Org. Mass Spectrom., 1993, 28, 4, 358, https://doi.org/10.1002/oms.1210280416
. [all data]
Mock and Grimsrud, 1989
Mock, R.S.; Grimsrud, E.P.,
Gas-Phase Electron Photodetachment Spectroscopy of the Molecular Anions of Nitroaromatic Hydrocarbons at Atmospheric Pressure,
J. Am. Chem. Soc., 1989, 111, 8, 2861, https://doi.org/10.1021/ja00190a020
. [all data]