1-Naphthalenol, 4-nitroso
- Formula: C10H7NO2
- Molecular weight: 173.1681
- IUPAC Standard InChIKey: ZVNOVIBCAIDQOE-UHFFFAOYSA-N
- CAS Registry Number: 605-60-7
- Chemical structure:
View 3d structure (requires JavaScript / HTML 5) - Permanent link for this species. Use this link for bookmarking this species for future reference.

Phase change data

Data compiled by: Hussein Y. Afeefy, Joel F. Liebman, and Stephen E. Stein
Quantity | Value | Units | Method | Reference | Comment |
---|---|---|---|---|---|
ΔsubH° | 87.4 ± 4.2 | kJ/mol | V | Hamilton and Fagley, 1968 | Reanalyzed by Pedley, Naylor, et al., 1986, Original value = 83.7 ± 4.2 kJ/mol; see Hamilton, 1964 |

Condensed phase thermochemistry data

Data compiled by: Hussein Y. Afeefy, Joel F. Liebman, and Stephen E. Stein

Quantity Value Units Method Reference Comment
Δcsolid-4827.7 ± 1.2kJ/molCcbHamilton and Fagley, 1968see Hamilton, 1964
Δcsolid-4868.1kJ/molCcbSwietoslawski and Starczedska, 1925

Gas phase thermochemistry data

Data compiled by: Hussein Y. Afeefy, Joel F. Liebman, and Stephen E. Stein

Quantity Value Units Method Reference Comment
Δfgas-20.4kJ/molCcbHamilton and Fagley, 1968see Hamilton, 1964

References

Hamilton and Fagley, 1968
Hamilton, J.V.; Fagley, T.F.,
Thermochemical study of the structures of 1,2-, 2,1-, and 4,1-nitrosonaphthols,
J. Chem. Eng. Data, 1968, 13, 523-527. [all data]
Pedley, Naylor, et al., 1986
Pedley, J.B.; Naylor, R.D.; Kirby, S.P.,
Thermochemical Data of Organic Compounds, Chapman and Hall, New York, 1986, 1-792. [all data]
Hamilton, 1964
Hamilton, J.V.,
A thermochemical study of the structures of 1,2-, 2,1- and 4,1-nitrosonaphthols, Dissertation Abstract, 1964, 3113. [all data]