cyclopentanemethylamine
- Formula: C6H13N
- Molecular weight: 99.1741
- IUPAC Standard InChIKey: TWASBYPJZBHZQJ-UHFFFAOYSA-N
- CAS Registry Number: 6053-81-2
- Chemical structure:
View 3d structure (requires JavaScript / HTML 5) - Species with the same structure:
- Other names: cyclopentane, 1-amino-1-methyl-

Phase change data

Data compiled by: Thermodynamics Research Center, NIST Boulder Laboratories, Chris Muzny director
Quantity | Value | Units | Method | Reference | Comment |
---|---|---|---|---|---|
Tboil | 387.15 | K | N/A | Kornblum, Clutter, et al., 1956 | Uncertainty assigned by TRC = 2. K |

References

Kornblum, Clutter, et al., 1956
Kornblum, N.; Clutter, R.J.; Jones, W.J.,
Synthesis of Tertiary Nitroparaffins,
J. Am. Chem. Soc., 1956, 78, 4003. [all data]