Tartaramide

Condensed phase thermochemistry data

Data compiled by: Hussein Y. Afeefy, Joel F. Liebman, and Stephen E. Stein

Quantity Value Units Method Reference Comment
Δcsolid-1784. ± 0.4kJ/molCcbCoops and Verkade, 1925At 288 K

References

Coops and Verkade, 1925
Coops, J.; Verkade, P.E., Calorimetric researches. - IX. The heat of combustion of f. and meso-tartaric acids, reacemic acid and a number of their derivatives, Recl. Trav. Chim. Pays-Bas, 1925, 983-1011. [all data]