Naphthalene, 1-phenyl-
- Formula: C16H12
- Molecular weight: 204.2665
- IUPAC Standard InChIKey: IYDMICQAKLQHLA-UHFFFAOYSA-N
- CAS Registry Number: 605-02-7
- Chemical structure:
View 3d structure (requires JavaScript / HTML 5) - Other names: 1-Phenylnaphthalene

Phase change data

Data compiled as indicated in comments:
BS - Robert L. Brown and Stephen E. Stein
AC - William E. Acree, Jr., James S. Chickos
Quantity | Value | Units | Method | Reference | Comment |
---|---|---|---|---|---|
Tboil | 597.7 | K | N/A | Aldrich Chemical Company Inc., 1990 | BS |
Tboil | 607.2 | K | N/A | Weast and Grasselli, 1989 | BS |
Quantity | Value | Units | Method | Reference | Comment |
ΔvapH° | 19.4 ± 0.43 | kcal/mol | C | Rocha, Lima, et al., 2008 | AC |
Enthalpy of sublimation
ΔsubH (kcal/mol) | Temperature (K) | Method | Reference | Comment |
---|---|---|---|---|
21.2 | 383. | GS | Nass, Lenoir, et al., 1995 | Based on data from 313. to 453. K.; AC |

Van Den Dool and Kratz RI, non-polar column, temperature ramp

Data compiled by: NIST Mass Spectrometry Data Center, William E. Wallace, director

Column type CapillaryCapillaryCapillaryCapillaryCapillary
Active phase DB-5DB-5DB-5DB-5DB-5
Column length (m) 30.30.30.30.30.
Carrier gas HeHeHeHeHe
Substrate
Column diameter (mm) 0.250.250.250.250.25
Phase thickness (μm) 0.250.250.250.250.25
Tstart (C) 40.40.40.40.40.
Tend (C) 310.310.310.310.310.
Heat rate (K/min) 4.4.2.4.6.
Initial hold (min)  5.
Final hold (min)
I 1858.21858.21841.71858.21868.0
ReferenceSong, Lai, et al., 2003Song, Lai, et al., 2003Song, Lai, et al., 2003Song, Lai, et al., 2003Song, Lai, et al., 2003
Comment MSDC-RI MSDC-RI MSDC-RI MSDC-RI MSDC-RI
Column type CapillaryCapillaryCapillaryCapillaryCapillary
Active phase OV-1OV-1DB-5DB-5DB-5
Column length (m) 25.25.30.30.30.
Carrier gas   HeHeHe
Substrate
Column diameter (mm) 0.20.20.250.250.25
Phase thickness (μm) 0.330.330.250.250.25
Tstart (C) 100.100.40.40.40.
Tend (C) 180.180.310.310.310.
Heat rate (K/min) 5.5.2.4.6.
Initial hold (min)
Final hold (min)
I 1834.61847.01841.71858.21868.
ReferenceZhang, Shen, et al., 2000Zhang, Shen, et al., 2000Lai and Song, 1995Lai and Song, 1995Lai and Song, 1995
Comment MSDC-RI MSDC-RI MSDC-RI MSDC-RI MSDC-RI
Column type CapillaryCapillaryCapillaryCapillary
Active phase DB-5DB-5SE-54DB-5
Column length (m) 30.30.25.30.
Carrier gas HeHeHeHe
Substrate
Column diameter (mm) 0.250.250.320.26
Phase thickness (μm) 0.250.250.150.25
Tstart (C) 40.40.40.50.
Tend (C) 310.310.280.300.
Heat rate (K/min) 4.4.5.6.
Initial hold (min)  5.1.4.
Final hold (min)   15.20.
I 1858.21858.21827.21872.
ReferenceLai and Song, 1995Lai and Song, 1995Shapi and Hesso, 1990Rostad and Pereira, 1986
Comment MSDC-RI MSDC-RI MSDC-RI MSDC-RI

References

Aldrich Chemical Company Inc., 1990
Aldrich Chemical Company Inc.,
Catalog Handbook of Fine Chemicals, Aldrich Chemical Company, Inc., Milwaukee WI, 1990, 1. [all data]
Weast and Grasselli, 1989
CRC Handbook of Data on Organic Compounds, 2nd Editon, Weast,R.C and Grasselli, J.G., ed(s)., CRC Press, Inc., Boca Raton, FL, 1989, 1. [all data]
Rocha, Lima, et al., 2008
Rocha, Marisa A.A.; Lima, Carlos F.R.A.C.; Santos, Luís M.N.B.F.,
Phase transition thermodynamics of phenyl and biphenyl naphthalenes,
The Journal of Chemical Thermodynamics, 2008, 40, 9, 1458-1463, https://doi.org/10.1016/j.jct.2008.04.010
. [all data]
Nass, Lenoir, et al., 1995
Nass, Karen; Lenoir, Dieter; Kettrup, Antonius,
Calculation of the Thermodynamic Properties of Polycyclic Aromatic Hydrocarbons by an Incremental Procedure,
Angew. Chem. Int. Ed. Engl., 1995, 34, 16, 1735-1736, https://doi.org/10.1002/anie.199517351
. [all data]