Propanamide, N-(1-oxopropyl)-
- Formula: C6H11NO2
- Molecular weight: 129.1570
- IUPAC Standard InChIKey: GOJDSMIXPMMHPO-UHFFFAOYSA-N
- CAS Registry Number: 6050-26-6
- Chemical structure:
View 3d structure (requires JavaScript / HTML 5) - Other names: Dipropionamide

Condensed phase thermochemistry data

Data compiled by: Hussein Y. Afeefy, Joel F. Liebman, and Stephen E. Stein
Quantity | Value | Units | Method | Reference | Comment |
---|---|---|---|---|---|
ΔcH°solid | -3382.24 | kJ/mol | Ccb | Parts, 1928 |

Phase change data

Data compiled by: Robert L. Brown and Stephen E. Stein
Quantity | Value | Units | Method | Reference | Comment |
---|---|---|---|---|---|
Tboil | 488.2 | K | N/A | Weast and Grasselli, 1989 |

References

Parts, 1928
Parts, A.,
Uber die Verbrennungswarme von einigen sekundaren und tertiaren Amiden,
Z. Phys. Chem., 1928, 131, 405-408. [all data]
Weast and Grasselli, 1989
CRC Handbook of Data on Organic Compounds, 2nd Editon, Weast,R.C and Grasselli, J.G., ed(s)., CRC Press, Inc., Boca Raton, FL, 1989, 1. [all data]
Johnson, 1966
Johnson, E.A.,
UV atlas of organic compounds, 1966, 1, B10/2. [all data]