Artemiseole
- Formula: C10H16O
- Molecular weight: 152.2334
- IUPAC Standard InChIKey: HHDOWVHECSBICN-UHFFFAOYSA-N
- CAS Registry Number: 60485-46-3
- Chemical structure:
View 3d structure (requires JavaScript / HTML 5) - Other names: 1,6,6-Trimethyl-4-ethenyl-exo-2-oxabicyclo[3.1.0] hexane; Artemiseol; Artemiseole (Arthole)

Van Den Dool and Kratz RI, non-polar column, temperature ramp

Column type | Active phase | I | Reference | Comment |
---|---|---|---|---|
Capillary | DB-1 | 967.8 | Helmig, Klinger, et al., 1999 | 60. m/0.32 mm/1. μm, -50. C @ 2. min, 6. K/min; Tend: 175. C |

Normal alkane RI, non-polar column, custom temperature program

Column type | Active phase | I | Reference | Comment |
---|---|---|---|---|
Capillary | SE-30 | 967. | Vinogradov, 2004 | Program: not specified |
Capillary | Polydimethyl siloxanes | 967. | Zenkevich, 1997 | Program: not specified |

References

Helmig, Klinger, et al., 1999
Helmig, D.; Klinger, L.F.; Guenther, A.; Vierling, L.; Geron, C.; Zimmerman, P.,
Biogenic volatile organic compound emissions (BVOCs). I. Identifications from three continental sites in the U.S.,
Chemosphere, 1999, 38, 9, 2163-2187, https://doi.org/10.1016/S0045-6535(98)00425-1
. [all data]
Vinogradov, 2004
Vinogradov, B.A.,
Production, composition, properties and application of essential oils, 2004, retrieved from http://viness.narod.ru. [all data]
Zenkevich, 1997
Zenkevich, I.G.,
Analytical Parameters of Components of Essential Oils for their Chromatographic and Chromato-Spectral Identificaiton. Oxsigenated derivatives of Mono- and Sesquiterpene Hydrocarbons,
Rastit, Resursy (Rus.), 1997, 33, 1, 16-28. [all data]