cis-α-decalol

Phase change data

Data compiled by: Thermodynamics Research Center, NIST Boulder Laboratories, Chris Muzny director

Quantity Value Units Method Reference Comment
Tfus365.65KN/AZeiss and Tsutsui, 1953Uncertainty assigned by TRC = 1.5 K

In addition to the Thermodynamics Research Center (TRC) data available from this site, much more physical and chemical property data is available from the following TRC products:

References

Zeiss and Tsutsui, 1953
Zeiss, H.H.; Tsutsui, M., The Carbon-Oxygen Absorption Band in the Infrared Spectra of Alcohols, J. Am. Chem. Soc., 1953, 75, 897. [all data]