Oxiranemethanol, (S)-
- Formula: C3H6O2
- Molecular weight: 74.0785
- IUPAC Standard InChIKey: CTKINSOISVBQLD-VKHMYHEASA-N
- CAS Registry Number: 60456-23-7
- Chemical structure:
- Other names: (S)-(-)-Glycidol; 2-Oxiranemethanol, (2S)-

Phase change data

Data compiled by: Robert L. Brown and Stephen E. Stein
Reduced pressure boiling point
Tboil (K) | Pressure (bar) | Reference |
---|---|---|
339.7 | 0.025 | Aldrich Chemical Company Inc., 1990 |

References

Aldrich Chemical Company Inc., 1990
Aldrich Chemical Company Inc.,
Catalog Handbook of Fine Chemicals, Aldrich Chemical Company, Inc., Milwaukee WI, 1990, 1. [all data]