1,1'-Binaphthalene
- Formula: C20H14
- Molecular weight: 254.3252
- IUPAC Standard InChIKey: ZDZHCHYQNPQSGG-UHFFFAOYSA-N
- CAS Registry Number: 604-53-5
- Chemical structure:
View 3d structure (requires JavaScript / HTML 5) - Species with the same structure:
- Other names: 1,1'-Binaphthyl; α,α'-Dinaphthylene; 1,1'-Dinaphthyl; Di-α-naphthol; 1,1'-Binaphtyl

Condensed phase thermochemistry data

Data compiled by: Hussein Y. Afeefy, Joel F. Liebman, and Stephen E. Stein
Quantity | Value | Units | Method | Reference | Comment |
---|---|---|---|---|---|
ΔcH°solid | -10040. | kJ/mol | Ccb | Pongratz, Griengl, et al., 1932 | At 288 K; Corresponding ΔfHºsolid = 169. kJ/mol (simple calculation by NIST; no Washburn corrections) |

Phase change data

Data compiled as indicated in comments:
TRC - Thermodynamics Research Center, NIST Boulder Laboratories, Chris Muzny director
AC - William E. Acree, Jr., James S. Chickos
Quantity | Value | Units | Method | Reference | Comment |
---|---|---|---|---|---|
Tfus | 421.5 | K | N/A | Sangster and Irvine, 1956 | Uncertainty assigned by TRC = 5. K; TRC |
Tfus | 433.8 | K | N/A | Sangster and Irvine, 1956 | Uncertainty assigned by TRC = 2. K; TRC |
Enthalpy of fusion
ΔfusH (kJ/mol) | Temperature (K) | Method | Reference | Comment |
---|---|---|---|---|
19.2 | 431.2 | DSC | Sainz-Díaz, Martín-Islán, et al., 2005 | AC |

Van Den Dool and Kratz RI, non-polar column, temperature ramp

Column type | Active phase | I | Reference | Comment |
---|---|---|---|---|
Capillary | DB-5 | 2381. | Rostad and Pereira, 1986 | 30. m/0.26 mm/0.25 μm, He, 50. C @ 4. min, 6. K/min, 300. C @ 20. min |

Lee's RI, non-polar column, temperature ramp

Column type | Active phase | I | Reference | Comment |
---|---|---|---|---|
Capillary | DB-5 | 390.0 | Durlak, Biswas, et al., 1998 | 30. m/0.25 mm/0.25 μm, 15. K/min; Tstart: 50. C; Tend: 300. C |
Capillary | DB-5 | 385.23 | Rostad and Pereira, 1986 | 30. m/0.26 mm/0.25 μm, He, 50. C @ 4. min, 6. K/min, 300. C @ 20. min |
Capillary | SE-52 | 388.38 | Lee, Vassilaros, et al., 1979 | 12. m/0.3 mm/0.34 μm, He, 2. K/min; Tstart: 50. C; Tend: 250. C |

Lee's RI, non-polar column, custom temperature program

Column type | Active phase | I | Reference | Comment |
---|---|---|---|---|
Capillary | HP-5MS | 402.77 | Wang, Li, et al., 2007 | 30. m/0.25 mm/0.25 μm, He; Program: 60C(2min) => 6C/min => 258C => 2C/min => 300C(4min) |
Capillary | HP-5MS | 402.77 | Wang, Li, et al., 2007, 2 | 30. m/0.25 mm/0.25 μm, He; Program: not specified |
Capillary | OV-101 | 386.1 | Tucminen, Wickstrom, et al., 1986 | Program: not specified |
Capillary | SE-52 | 388.38 | Shlyakhov, 1984 | Program: not specified |

References

Pongratz, Griengl, et al., 1932
Pongratz, A.; Griengl, F.; Gecelsky, J.,
Untersuchungen uber Perylen und seine derivate. Uber verbrennungswarmen von perylenderivaten,
Sitzungsber. Akad. Wiss. Wien Math. Naturwiss. Kl. Abt. 2B, 1932, 833-839. [all data]
Sangster and Irvine, 1956
Sangster, R.C.; Irvine, J.W.,
Study of Organic Scintillators,
J. Chem. Phys., 1956, 24, 670. [all data]
Sainz-Díaz, Martín-Islán, et al., 2005
Sainz-Díaz, C. Ignacio; Martín-Islán, Africa P.; Cartwright, Julyan H.E.,
Chiral Symmetry Breaking and Polymorphism in 1,1'-Binaphthyl Melt Crystallization,
J. Phys. Chem. B, 2005, 109, 40, 18758-18764, https://doi.org/10.1021/jp0518198
. [all data]
Friedel, Orchin, et al., 1948
Friedel, R.A.; Orchin, M.; Reggel, L.,
Steric hindrance and short wave length bands in the ultraviolet spectra of some naphthalene and diphenyl derivatives,
J. Am. Chem. Soc., 1948, 70, 199-204. [all data]
Rostad and Pereira, 1986
Rostad, C.E.; Pereira, W.E.,
Kovats and Lee retention indices determined by gas chromatography/mass spectrometry for organic compounds of environmental interest,
J. Hi. Res. Chromatogr. Chromatogr. Comm., 1986, 9, 6, 328-334, https://doi.org/10.1002/jhrc.1240090603
. [all data]
Durlak, Biswas, et al., 1998
Durlak, S.K.; Biswas, P.; Shi, J.; Bernhard, M.J.,
Characterization of polycyclic aromatic hydrocarbon particulate and gaseous emissions from polystyrene combustion,
Environ. Sci. Technol., 1998, 32, 15, 2301-2307, https://doi.org/10.1021/es9709031
. [all data]
Lee, Vassilaros, et al., 1979
Lee, M.L.; Vassilaros, D.L.; White, C.M.; Novotny, M.,
Retention Indices for Programmed-Temperature Capillary-Column Gas Chromatography of Polycyclic Aromatic Hydrocarbons,
Anal. Chem., 1979, 51, 6, 768-773, https://doi.org/10.1021/ac50042a043
. [all data]
Wang, Li, et al., 2007
Wang, Z.; Li, K.; Lambert, P.; Yang, C.,
Identification, characterization and quantitation of pyrogenic polycylic aromatic hydrocarbons and other organic compounds in tire fire products,
J. Chromatogr. A, 2007, 1139, 1, 14-26, https://doi.org/10.1016/j.chroma.2006.10.085
. [all data]
Wang, Li, et al., 2007, 2
Wang, Z.; Li, K.; Lambert, P.; Brown, C.E.; Yang, C.; Hollebone, B.P.,
Identification and characterization of polycyclic aromatic compounds in tire fire products and differentiation of pyrogenic PAHs from petrogenic PAHs
in Proceedings of the 30th Arctic and Marine Oilspill (AMOP) Technical Seminar. Vol.1, 2007, 61-85. [all data]
Tucminen, Wickstrom, et al., 1986
Tucminen, A.; Wickstrom, K.; Pyysalo, H.,
Determination of Polycyclic Aromatic Compounds by GLC-Selected Ion Monitoring (SIM) Technique,
J. Hi. Res. Chromatogr. Chromatogr. Comm., 1986, 9, 8, 469-471, https://doi.org/10.1002/jhrc.1240090813
. [all data]
Shlyakhov, 1984
Shlyakhov, A.F.,
Gas chromatography in organic geochemistry, Nedra, Moscow, 1984, 221. [all data]