Acrolein,dimethyl acetal
- Formula: C5H10O2
- Molecular weight: 102.1317
- IUPAC Standard InChIKey: OBWGMYALGNDUNM-UHFFFAOYSA-N
- CAS Registry Number: 6044-68-4
- Chemical structure:
View 3d structure (requires JavaScript / HTML 5) - Other names: 1-Propene, 3,3-dimethoxy-; 3,3-Dimethoxypropene-1; 3,3-dimethoxypropene

Phase change data

Data compiled by: Robert L. Brown and Stephen E. Stein
Quantity | Value | Units | Method | Reference | Comment |
---|---|---|---|---|---|
Tboil | 362.7 | K | N/A | Weast and Grasselli, 1989 |

Normal alkane RI, non-polar column, temperature ramp

Column type | Active phase | I | Reference | Comment |
---|---|---|---|---|
Capillary | OV-101 | 668. | Zenkevich, 2005 | 25. m/0.20 mm/0.10 μm, N2/He, 6. K/min; Tstart: 50. C; Tend: 250. C |

References

Weast and Grasselli, 1989
CRC Handbook of Data on Organic Compounds, 2nd Editon, Weast,R.C and Grasselli, J.G., ed(s)., CRC Press, Inc., Boca Raton, FL, 1989, 1. [all data]
Zenkevich, 2005
Zenkevich, I.G.,
Experimentally measured retention indices., 2005. [all data]