Cholest-5-en-3-ol (3β)-, acetate
- Formula: C29H48O2
- Molecular weight: 428.6902
- IUPAC Standard InChIKey: XUGISPSHIFXEHZ-WOOIZHOCSA-N
- CAS Registry Number: 604-35-3
- Chemical structure:
View 3d structure (requires JavaScript / HTML 5) - Stereoisomers:
- Other names: Cholesterol, acetate; (-)-Cholesteryl acetate; Cholest-5-en-3β-ol acetate; Cholest-5-en-3β-yl acetate; Cholesterin acetate; Cholesteryl acetate; 3β-Acetoxycholest-5-ene; 5-Cholesten-3β-ol acetate; Cholest-5-en-3-yl acetate, (3β)-; 5-Cholesten-3-beta-ol, acetate; 3-Cholesteryl acetate; NSC 8799; 5-Cholesten-3B-ol, acetate

Phase change data

Data compiled by: Thermodynamics Research Center, NIST Boulder Laboratories, Chris Muzny director
Quantity | Value | Units | Method | Reference | Comment |
---|---|---|---|---|---|
Tfus | 387.8 | K | N/A | Davis, Porter, et al., 1970 | Uncertainty assigned by TRC = 0.5 K |

References

Davis, Porter, et al., 1970
Davis, G.J.; Porter, R.S.; Barrall, E.M.,
Evaluation of Thermal Transitions in Some Cholesteryl Esters of Saturated Aliphatic Acids,
Mol. Cryst. Liq. Cryst., 1970, 10, 1-2, 1, https://doi.org/10.1080/15421407008083482
. [all data]