Benzoic acid, 2,3-dimethyl-
- Formula: C9H10O2
- Molecular weight: 150.1745
- IUPAC Standard InChIKey: RIZUCYSQUWMQLX-UHFFFAOYSA-N
- CAS Registry Number: 603-79-2
- Chemical structure:
View 3d structure (requires JavaScript / HTML 5) - Other names: Hemellitic acid; 2,3-Dimethylbenzoic acid

Gas phase thermochemistry data

Data compiled as indicated in comments:
ALS - Hussein Y. Afeefy, Joel F. Liebman, and Stephen E. Stein
DRB - Donald R. Burgess, Jr.
Quantity | Value | Units | Method | Reference | Comment |
---|---|---|---|---|---|
ΔfH°gas | -345.8 ± 1.7 | kJ/mol | Ccb | Colomina, Jimenez, et al., 1984 | see Colomina, Perez-Ossorio, et al., 1961 and Colomina, Perez Ossorio, et al., 1959; ALS |
ΔfH°gas | -345.8 | kJ/mol | N/A | Corral, 1960 | Value computed using ΔfHsolid° value of -450.4±1.0 kj/mol from Corral, 1960 and ΔsubH° value of 104.6 kj/mol from Colomina, Jimenez, et al., 1984.; DRB |

Condensed phase thermochemistry data

Data compiled as indicated in comments:
ALS - Hussein Y. Afeefy, Joel F. Liebman, and Stephen E. Stein
DH - Eugene S. Domalski and Elizabeth D. Hearing
Quantity | Value | Units | Method | Reference | Comment |
---|---|---|---|---|---|
ΔfH°solid | -450.4 ± 1.7 | kJ/mol | Ccb | Colomina, Jimenez, et al., 1984 | see Colomina, Perez-Ossorio, et al., 1961 and Colomina, Perez Ossorio, et al., 1959; ALS |
ΔfH°solid | -450.41 ± 0.96 | kJ/mol | Ccb | Corral, 1960 | Different experiments; ALS |
Quantity | Value | Units | Method | Reference | Comment |
ΔcH°solid | -4520.39 ± 0.79 | kJ/mol | Ccb | Corral, 1960 | Different experiments; Corresponding ΔfHºsolid = -450.37 kJ/mol (simple calculation by NIST; no Washburn corrections); ALS |
Constant pressure heat capacity of solid
Cp,solid (J/mol*K) | Temperature (K) | Reference | Comment |
---|---|---|---|
216.3 | 299.65 | Colomina, Jimenez, et al., 1984 | DH |

Phase change data

Data compiled as indicated in comments:
TRC - Thermodynamics Research Center, NIST Boulder Laboratories, Chris Muzny director
ALS - Hussein Y. Afeefy, Joel F. Liebman, and Stephen E. Stein
DRB - Donald R. Burgess, Jr.
AC - William E. Acree, Jr., James S. Chickos
Quantity | Value | Units | Method | Reference | Comment |
---|---|---|---|---|---|
Tfus | 416.7 | K | N/A | Birch, Dean, et al., 1949 | Uncertainty assigned by TRC = 2. K; TRC |
Quantity | Value | Units | Method | Reference | Comment |
ΔsubH° | 104.6 ± 0.4 | kJ/mol | V | Colomina, Jimenez, et al., 1984 | see Colomina, Perez-Ossorio, et al., 1961 and Colomina, Perez Ossorio, et al., 1959; ALS |
ΔsubH° | 104.6 | kJ/mol | N/A | Colomina, Jimenez, et al., 1984 | DRB |
ΔsubH° | 104.6 ± 0.4 | kJ/mol | ME | Colomina, Jimenez, et al., 1984 | Based on data from 316. to 337. K.; AC |
Enthalpy of sublimation
ΔsubH (kJ/mol) | Temperature (K) | Method | Reference | Comment |
---|---|---|---|---|
102.3 ± 0.4 | 326. | ME | Colomina, Jimenez, et al., 1984 | Based on data from 316. to 337. K.; AC |
Enthalpy of fusion
ΔfusH (kJ/mol) | Temperature (K) | Reference | Comment |
---|---|---|---|
18.3 | 417.6 | Belhachemi, Ufnalsky, et al., 1996 | AC |

Reaction thermochemistry data

Data compiled by: John E. Bartmess
Individual Reactions
C9H9O2- + =
By formula: C9H9O2- + H+ = C9H10O2
Quantity | Value | Units | Method | Reference | Comment |
---|---|---|---|---|---|
ΔrH° | 1419. ± 8.8 | kJ/mol | G+TS | Decouzon, Ertl, et al., 1993 | gas phase; relative to benzoate at 333.0 kcal/mol |
Quantity | Value | Units | Method | Reference | Comment |
ΔrG° | 1390. ± 8.4 | kJ/mol | IMRE | Decouzon, Ertl, et al., 1993 | gas phase; relative to benzoate at 333.0 kcal/mol |

Gas phase ion energetics data

Data compiled by: John E. Bartmess
De-protonation reactions
C9H9O2- + =
By formula: C9H9O2- + H+ = C9H10O2
Quantity | Value | Units | Method | Reference | Comment |
---|---|---|---|---|---|
ΔrH° | 1419. ± 8.8 | kJ/mol | G+TS | Decouzon, Ertl, et al., 1993 | gas phase; relative to benzoate at 333.0 kcal/mol |
Quantity | Value | Units | Method | Reference | Comment |
ΔrG° | 1390. ± 8.4 | kJ/mol | IMRE | Decouzon, Ertl, et al., 1993 | gas phase; relative to benzoate at 333.0 kcal/mol |

References

Colomina, Jimenez, et al., 1984
Colomina, M.; Jimenez, P.; Roux, M.V.; Turrion, C.,
Thermochemical properties of benzoic acid derivatives. XI. Vapour pressures and enthalpies of sublimation and formation of the six dimethylbenzoic acids,
J. Chem. Thermodyn., 1984, 16, 1121-1127. [all data]
Colomina, Perez-Ossorio, et al., 1961
Colomina, M.; Perez-Ossorio, R.; Boned, M.L.; Panea, M.; Turrion, C.,
Investigaciones termoquimicas sobre los acidos alquilbenzoicos. II. Acidos dimetrilbenzoicos,
Anal. Fisc. Quim. B, 1961, 57, 665-672. [all data]
Colomina, Perez Ossorio, et al., 1959
Colomina, M.; Perez Ossorio, R.; Boned, M.L.; Panea, M.; Turrion, C.,
Thermochemical investigations on methylsubstituted benzoic acids, Rpt. for the U.S. Dept. of the Army, European Research Office contract no. DA-91-508-EUC-358 by Instituto de Quimica Fisica Madrid, Spain, 1959, 1-36. [all data]
Corral, 1960
Corral, L.B.,
Investigaciones termoquimicas sobre los acidos toluicos y dimetilbenzoicos,
Rev. R. Acad. Cienc., 1960, 54, 365-403. [all data]
Birch, Dean, et al., 1949
Birch, S.F.; Dean, R.A.; Fidler, F.A.; Lowry, R.A.,
The preparation of the c(10) monocyclic aromatic hydrocarbons,
J. Am. Chem. Soc., 1949, 71, 1362. [all data]
Belhachemi, Ufnalsky, et al., 1996
Belhachemi, B.; Ufnalsky, W.; Derriche, Z.,
Determination of melting enthalpies and solubility curves in n-hexane of 2,3- and 3,5-dimethyl benzoic acids. Comparison with UNIFAC calculations,
J. Chim. Phys. Phys.-Chim. Biol., 1996, 93, 6, 1117. [all data]
Decouzon, Ertl, et al., 1993
Decouzon, M.; Ertl, P.; Exner, O.; Gal, J.F.; Maria, P.C.,
Concepts of Sterically Hindered Resonance and Buttressing Effect - Gas-Phase Acidities of Methyl-Substituted Benzoic Acids and Basicities of,
J. Am. Chem. Soc., 1993, 115, 25, 12071, https://doi.org/10.1021/ja00078a052
. [all data]