Acetamide
- Formula: C2H5NO
- Molecular weight: 59.0672
- IUPAC Standard InChIKey: DLFVBJFMPXGRIB-UHFFFAOYSA-N
- CAS Registry Number: 60-35-5
- Chemical structure:
View 3d structure (requires JavaScript / HTML 5) - Other names: Acetic acid amide; Ethanamide; Methanecarboxamide; CH3CONH2; NCI-C02108; Amid kyseliny octove

Gas phase thermochemistry data

Data compiled by: Hussein Y. Afeefy, Joel F. Liebman, and Stephen E. Stein
Quantity | Value | Units | Method | Reference | Comment |
---|---|---|---|---|---|
ΔfH°gas | -238.33 ± 0.78 | kJ/mol | Ccb | Barnes and Pilcher, 1975 |

Condensed phase thermochemistry data

Data compiled as indicated in comments:
ALS - Hussein Y. Afeefy, Joel F. Liebman, and Stephen E. Stein
DH - Eugene S. Domalski and Elizabeth D. Hearing
Quantity | Value | Units | Method | Reference | Comment |
---|---|---|---|---|---|
ΔfH°solid | -315.6 ± 0.82 | kJ/mol | Ccr | Nurachmetov, Beremzhanov, et al., 1985 | see Nurakhmeta, Beremzhanov, et al., 1984; ALS |
ΔfH°solid | -310.1 | kJ/mol | Ccb | Ciocazanu, Dogaru, et al., 1976 | ALS |
ΔfH°solid | -316.99 ± 0.70 | kJ/mol | Ccb | Barnes and Pilcher, 1975 | ALS |
Quantity | Value | Units | Method | Reference | Comment |
ΔcH°solid | -1186.03 ± 0.82 | kJ/mol | Ccr | Nurachmetov, Beremzhanov, et al., 1985 | see Nurakhmeta, Beremzhanov, et al., 1984; ALS |
ΔcH°solid | -1191.5 | kJ/mol | Ccb | Ciocazanu, Dogaru, et al., 1976 | ALS |
ΔcH°solid | -1184.60 ± 0.69 | kJ/mol | Ccb | Barnes and Pilcher, 1975 | ALS |
Quantity | Value | Units | Method | Reference | Comment |
S°solid,1 bar | 115.0 | J/mol*K | N/A | Nurachmetov, Beremzhanov, et al., 1985 | DH |
S°solid,1 bar | 115.0 | J/mol*K | N/A | Nurakhmetov, Beremzhanov, et al., 1984 | DH |
Constant pressure heat capacity of solid
Cp,solid (J/mol*K) | Temperature (K) | Reference | Comment |
---|---|---|---|
86.65 | 298. | Emons, Naumann, et al., 1986 | T = 298 to 400 K. Cp data given at 298 K as 1.467 kJ/kg*K (extrapolated). Cp = 1.481 + 0.0069(T-300) kJ/kg*K (300 to 330).; DH |
91.27 | 298.15 | Nurachmetov, Beremzhanov, et al., 1985 | T = 13 to 330 K.; DH |
91.27 | 298.15 | Nurakhmetov, Beremzhanov, et al., 1984 | T = 8 to 330 K.; DH |
90.00 | 300. | DeWit, DeKruif, et al., 1983 | T = 90 to 360 K.; DH |
90.3 | 298.15 | Skold, Suurkuusk, et al., 1976 | DH |
66.5 | 293. | Campbell and Campbell, 1940 | DH |

Phase change data

Data compiled as indicated in comments:
BS - Robert L. Brown and Stephen E. Stein
TRC - Thermodynamics Research Center, NIST Boulder Laboratories, Chris Muzny director
AC - William E. Acree, Jr., James S. Chickos
ALS - Hussein Y. Afeefy, Joel F. Liebman, and Stephen E. Stein
DH - Eugene S. Domalski and Elizabeth D. Hearing
Quantity | Value | Units | Method | Reference | Comment |
---|---|---|---|---|---|
Tboil | 494.4 ± 0.5 | K | AVG | N/A | Average of 6 values; Individual data points |
Quantity | Value | Units | Method | Reference | Comment |
Tfus | 352. ± 9. | K | AVG | N/A | Average of 6 values; Individual data points |
Quantity | Value | Units | Method | Reference | Comment |
Ttriple | 353.33 | K | N/A | De Wit, De Kruif, et al., 1983 | Uncertainty assigned by TRC = 0.02 K; TRC |
Quantity | Value | Units | Method | Reference | Comment |
ΔsubH° | 77.2 | kJ/mol | N/A | De Wit, Van Miltenburg, et al., 1983 | AC |
ΔsubH° | 78.66 ± 0.33 | kJ/mol | V | Barnes and Pilcher, 1975 | ALS |
ΔsubH° | 80. ± 1. | kJ/mol | N/A | Morawetz, 1971 | AC |
ΔsubH° | 80.3 ± 1.3 | kJ/mol | C | Wadsö, Borgen, et al., 1965 | AC |
ΔsubH° | 80. ± 1. | kJ/mol | C | Wadso, 1965 | ALS |
Reduced pressure boiling point
Tboil (K) | Pressure (bar) | Reference | Comment |
---|---|---|---|
365. | 0.007 | Buckingham and Donaghy, 1982 | BS |
Enthalpy of vaporization
ΔvapH (kJ/mol) | Temperature (K) | Method | Reference | Comment |
---|---|---|---|---|
63.8 | 396. | A | Stephenson and Malanowski, 1987 | Based on data from 381. to 492. K.; AC |
60.9 | 353. | N/A | Stull, 1947 | Based on data from 338. to 495. K.; AC |
Antoine Equation Parameters
log10(P) = A − (B / (T + C))
P = vapor pressure (bar)
T = temperature (K)
View plot Requires a JavaScript / HTML 5 canvas capable browser.
Temperature (K) | A | B | C | Reference | Comment |
---|---|---|---|---|---|
338. to 495. | 5.3711 | 2413.323 | -45.444 | Stull, 1947 | Coefficents calculated by NIST from author's data. |
Enthalpy of sublimation
ΔsubH (kJ/mol) | Temperature (K) | Method | Reference | Comment |
---|---|---|---|---|
77.8 | 284. | TE,ME | De Wit, Van Miltenburg, et al., 1983 | Based on data from 273. to 293. K.; AC |
77.4 ± 0.4 | 323. | GS | Davies, Jones, et al., 1959 | Based on data from 298. to 349. K. See also Stephenson and Malanowski, 1987.; AC |
Enthalpy of fusion
ΔfusH (kJ/mol) | Temperature (K) | Reference | Comment |
---|---|---|---|
15.500 | 354.05 | Nikolic, Tripkovic, et al., 1989 | DH |
12.522 to 12.877 | 342.15 | Emons, Naumann, et al., 1986 | DH |
15.606 | 353.5 | Emons, Naumann, et al., 1986 | DH |
15.590 | 353.33 | DeWit, DeKruif, et al., 1983 | DH |
15.6 | 353. | Domalski and Hearing, 1996 | AC |
Entropy of fusion
ΔfusS (J/mol*K) | Temperature (K) | Reference | Comment |
---|---|---|---|
36.6 to 37.6 | 342.15 | Emons, Naumann, et al., 1986 | DH |
44.15 | 353.5 | Emons, Naumann, et al., 1986 | DH |
44.1 | 353.33 | DeWit, DeKruif, et al., 1983 | DH |

Ion clustering data

Data compiled by: Robert C. Dunbar
Clustering reactions
By formula: K+ + C2H5NO = (K+ • C2H5NO)
Quantity | Value | Units | Method | Reference | Comment |
---|---|---|---|---|---|
ΔrH° | 124. | kJ/mol | CIDT | Klassen, Anderson, et al., 1996 |
By formula: Na+ + C2H5NO = (Na+ • C2H5NO)
Quantity | Value | Units | Method | Reference | Comment |
---|---|---|---|---|---|
ΔrH° | 145. | kJ/mol | CIDT | Klassen, Anderson, et al., 1996 |

Reaction thermochemistry data

Data compiled as indicated in comments:
B - John E. Bartmess
ALS - Hussein Y. Afeefy, Joel F. Liebman, and Stephen E. Stein
RCD - Robert C. Dunbar
Individual Reactions
C2H4NO- + =
By formula: C2H4NO- + H+ = C2H5NO
Quantity | Value | Units | Method | Reference | Comment |
---|---|---|---|---|---|
ΔrH° | 1515. ± 8.8 | kJ/mol | G+TS | Decouzon, Exner, et al., 1990 | gas phase; value altered from reference due to change in acidity scale; B |
ΔrH° | 1500. ± 5.0 | kJ/mol | EIAE | Muftakhov, Vasil'ev, et al., 1999 | gas phase; B |
Quantity | Value | Units | Method | Reference | Comment |
ΔrG° | 1485. ± 8.4 | kJ/mol | IMRE | Decouzon, Exner, et al., 1990 | gas phase; value altered from reference due to change in acidity scale; B |
By formula: C4H7NO2 + H2O = C2H5NO + C2H4O2
Quantity | Value | Units | Method | Reference | Comment |
---|---|---|---|---|---|
ΔrH° | -18.1 ± 0.2 | kJ/mol | Cm | Hill and Wadso, 1968 | solid phase; Heat of hydrolysis; ALS |
ΔrH° | -18.1 ± 0.2 | kJ/mol | Cm | Wadso, 1965 | solid phase; Heat of hydrolysis; ALS |
C2H4NO- + =
By formula: C2H4NO- + H+ = C2H5NO
Quantity | Value | Units | Method | Reference | Comment |
---|---|---|---|---|---|
ΔrH° | 1561. ± 13. | kJ/mol | G+TS | Hare, Marimanikkuppam, et al., 2001 | gas phase; B |
Quantity | Value | Units | Method | Reference | Comment |
ΔrG° | 1527. ± 13. | kJ/mol | IMRB | Hare, Marimanikkuppam, et al., 2001 | gas phase; B |
By formula: C6H9NO3 + 2H2O = C2H5NO + 2C2H4O2
Quantity | Value | Units | Method | Reference | Comment |
---|---|---|---|---|---|
ΔrH° | -103.5 ± 0.08 | kJ/mol | Cm | Hill and Wadso, 1968 | liquid phase; Heat of hydrolysis; ALS |
By formula: C2H5NO + H2O = C2H4O2 + H3N
Quantity | Value | Units | Method | Reference | Comment |
---|---|---|---|---|---|
ΔrH° | 76.1 ± 1.4 | kJ/mol | Cm | Hill and Wadso, 1968 | solid phase; Heat of hydrolysis; ALS |
By formula: HNaO + C2H5NO = C2H3NaO2 + H3N
Quantity | Value | Units | Method | Reference | Comment |
---|---|---|---|---|---|
ΔrH° | -45.6 | kJ/mol | Cm | Calvet, 1933 | solid phase; Heat of hydrolysis; ALS |
By formula: Na+ + C2H5NO = (Na+ • C2H5NO)
Quantity | Value | Units | Method | Reference | Comment |
---|---|---|---|---|---|
ΔrH° | 145. | kJ/mol | CIDT | Klassen, Anderson, et al., 1996 | RCD |
By formula: K+ + C2H5NO = (K+ • C2H5NO)
Quantity | Value | Units | Method | Reference | Comment |
---|---|---|---|---|---|
ΔrH° | 124. | kJ/mol | CIDT | Klassen, Anderson, et al., 1996 | RCD |

Gas phase ion energetics data

Data evaluated as indicated in comments:
HL - Edward P. Hunter and Sharon G. Lias
L - Sharon G. Lias
Data compiled as indicated in comments:
B - John E. Bartmess
LLK - Sharon G. Lias, Rhoda D. Levin, and Sherif A. Kafafi
RDSH - Henry M. Rosenstock, Keith Draxl, Bruce W. Steiner, and John T. Herron
Quantity | Value | Units | Method | Reference | Comment |
---|---|---|---|---|---|
IE (evaluated) | 9.69 ± 0.07 | eV | N/A | N/A | L |
Quantity | Value | Units | Method | Reference | Comment |
Proton affinity (review) | 863.6 | kJ/mol | N/A | Hunter and Lias, 1998 | HL |
Quantity | Value | Units | Method | Reference | Comment |
Gas basicity | 832.6 | kJ/mol | N/A | Hunter and Lias, 1998 | HL |
Ionization energy determinations
IE (eV) | Method | Reference | Comment |
---|---|---|---|
9.7 | PE | Asbrink, Svensson, et al., 1981 | LLK |
10.15 ± 0.05 | EI | Baldwin, Loudon, et al., 1977 | LLK |
9.62 | PE | Meeks, Arnett, et al., 1975 | LLK |
9.62 | PE | McGlynn and Meeks, 1975 | LLK |
9.80 | PE | Sweigart and Turner, 1972 | LLK |
9.77 ± 0.02 | PI | Watanabe, Nakayama, et al., 1962 | RDSH |
9.65 ± 0.03 | PI | Vilesov, 1960 | RDSH |
10.0 | PE | Asbrink, Svensson, et al., 1981 | Vertical value; LLK |
Appearance energy determinations
Ion | AE (eV) | Other Products | Method | Reference | Comment |
---|---|---|---|---|---|
CH2NO+ | 11.60 | ? | EI | Loudon and Webb, 1977 | LLK |
C2H3O+ | 11.70 | ? | EI | Loudon and Webb, 1977 | LLK |
De-protonation reactions
C2H4NO- + =
By formula: C2H4NO- + H+ = C2H5NO
Quantity | Value | Units | Method | Reference | Comment |
---|---|---|---|---|---|
ΔrH° | 1515. ± 8.8 | kJ/mol | G+TS | Decouzon, Exner, et al., 1990 | gas phase; value altered from reference due to change in acidity scale; B |
ΔrH° | 1500. ± 5.0 | kJ/mol | EIAE | Muftakhov, Vasil'ev, et al., 1999 | gas phase; B |
Quantity | Value | Units | Method | Reference | Comment |
ΔrG° | 1485. ± 8.4 | kJ/mol | IMRE | Decouzon, Exner, et al., 1990 | gas phase; value altered from reference due to change in acidity scale; B |
C2H4NO- + =
By formula: C2H4NO- + H+ = C2H5NO
Quantity | Value | Units | Method | Reference | Comment |
---|---|---|---|---|---|
ΔrH° | 1561. ± 13. | kJ/mol | G+TS | Hare, Marimanikkuppam, et al., 2001 | gas phase; B |
Quantity | Value | Units | Method | Reference | Comment |
ΔrG° | 1527. ± 13. | kJ/mol | IMRB | Hare, Marimanikkuppam, et al., 2001 | gas phase; B |

Van Den Dool and Kratz RI, non-polar column, temperature ramp

Column type | Active phase | I | Reference | Comment |
---|---|---|---|---|
Capillary | SPB-Sulfur | 719.8 | de Lacy Costello, Evans, et al., 2001 | 30. m/0.32 mm/4. μm, 40. C @ 12.5 min, 4. K/min; Tend: 200. C |

Van Den Dool and Kratz RI, polar column, custom temperature program

Column type | Active phase | I | Reference | Comment |
---|---|---|---|---|
Capillary | FFAP | 1788. | Yasuhara, 1987 | 50. m/0.25 mm/0.25 μm, He; Program: 20C (5min) => 2C/min => 70C => 4C/min => 210C |

Normal alkane RI, non-polar column, temperature ramp

Column type | Active phase | I | Reference | Comment |
---|---|---|---|---|
Capillary | DB-1 | 764. | Chen, Wang, et al., 1998 | 60. m/0.32 mm/1. μm, He, 3. K/min; Tstart: 40. C; Tend: 260. C |

Normal alkane RI, polar column, temperature ramp

Column type | Active phase | I | Reference | Comment |
---|---|---|---|---|
Capillary | RTX-Wax | 1738. | Prososki, Etzel, et al., 2007 | 30. m/0.25 mm/0.5 μm, He, 40. C @ 5. min, 10. K/min, 220. C @ 10. min |
Capillary | DB-Wax | 1764. | Wong and Bernhard, 1988 | He, 70. C @ 8. min, 2. K/min; Column length: 30. m; Column diameter: 0.25 mm; Tend: 160. C |

Normal alkane RI, polar column, custom temperature program

Column type | Active phase | I | Reference | Comment |
---|---|---|---|---|
Capillary | DB-Wax | 1763. | Kim. J.H., Ahn, et al., 2004 | 60. m/0.25 mm/0.25 μm, Helium; Program: 60 0C (3 min) 2 0C/min -> 150 0C 4 0C/min -> 200 0C |
Capillary | DB-Wax | 1725. | Peng, Yang, et al., 1991 | Program: not specified |
Capillary | DB-Wax | 1775. | Peng, Yang, et al., 1991 | Program: not specified |

References

Barnes and Pilcher, 1975
Barnes, D.S.; Pilcher, G.,
Enthalpies of combustion of ethanamide, propanamide, and butanamide,
J. Chem. Thermodyn., 1975, 7, 377-382. [all data]
Nurachmetov, Beremzhanov, et al., 1985
Nurachmetov, N.N.; Beremzhanov, B.A.; Abramova, G.V.; Lebedev, B.V.,
Thermodynamics of (thio)amides and their compounds with mineral acids at (0-330)K,
Thermochim. Acta, 1985, 92, 329-332. [all data]
Nurakhmeta, Beremzhanov, et al., 1984
Nurakhmeta, N.N.; Beremzhanov, B.A.; Abramova, G.V.; Lebedev, B.V.,
Thermodynamic properties of acetamide, thio-semicarbazide, and thiourea hydronitrate at (0-330) K,
Probl. Kalorim. Khim. Termodin., Dokl. Vses. Konf., 10th, 1984, 2, 460-462. [all data]
Ciocazanu, Dogaru, et al., 1976
Ciocazanu, I.; Dogaru, V.; Zavoianu, D.,
Structure and reactivity of amides. Concerning the heats of combustion and formation of some unsaturated α, β amides derived from acetamide,
Rev. Chim. (Bucharest), 1976, 27, 4-6. [all data]
Nurakhmetov, Beremzhanov, et al., 1984
Nurakhmetov, N.N.; Beremzhanov, B.A.; Abramova, G.V.; Lebedev, B.V.,
Thermodynamic properties of acetamide, thiosemicarbazide, and thiourea hydronitrate at (0-330) K, Probl. Kalorim. Khim. Termodin., Dokl. Vses. Konf.,
10th, 1984, 2, 460-2. [all data]
Emons, Naumann, et al., 1986
Emons, H.H.; Naumann, R.; Jahn, K.; Flammersheim, H.J.,
Thermal properties of acetamide in the temperature range from 298 K to 400 K,
Thermochim. Acta, 1986, 104, 127-137. [all data]
DeWit, DeKruif, et al., 1983
DeWit, H.G.M.; DeKruif, C.G.; Van Miltenburg, J.C.,
Thermodynamic properties of molecular organic crystals containing organic crystals containing nitrogen, oxygen, and sulfur. II. Molar heat capacities of eight compounds by adiabatic calorimetry,
J. Chem. Thermodynam., 1983, 15, 891-902. [all data]
Skold, Suurkuusk, et al., 1976
Skold, R.; Suurkuusk, J.; Wadso, I.,
Thermochemistry of solutions of biochemical model compounds. 7. Aqueous solutions of some amides, t-butanol, and pentanol,
J. Chem. Thermodynam., 1976, 8, 1075-1080. [all data]
Campbell and Campbell, 1940
Campbell, A.N.; Campbell, A.J.R.,
The heats of solution, heats of formation,
specific heats and equilibrium diagrams of certain molecular compounds. J. Am. Chem. Soc., 1940, 62, 291-297. [all data]
De Wit, De Kruif, et al., 1983
De Wit, H.G.M.; De Kruif, C.G.; Van Miltenburg, J.C.,
Thermodynamic properties of molecular organic crystals containing nitrogen, oxygen, and sulfur II. Molar heat capacities of eight compounds by adiabatic calorimetry,
J. Chem. Thermodyn., 1983, 15, 9, 891, https://doi.org/10.1016/0021-9614(83)90095-2
. [all data]
De Wit, Van Miltenburg, et al., 1983
De Wit, H.G.M.; Van Miltenburg, J.C.; De Kruif, C.G.,
Thermodynamic properties of molecular organic crystals containing nitrogen, oxygen, and sulphur 1. Vapour pressures and enthalpies of sublimation,
The Journal of Chemical Thermodynamics, 1983, 15, 7, 651-663, https://doi.org/10.1016/0021-9614(83)90079-4
. [all data]
Morawetz, 1971
Morawetz, E.,
, Ph.D. Dissertation, University of Lund, 1971. [all data]
Wadsö, Borgen, et al., 1965
Wadsö, Ingemar; Borgen, Gerd L.; Sørensen, Georg Ole; Olsen, Gert; Jansen, Gert,
Thermochemical Properties of Diacetamide, N-Butyldiacetamide and N-Phenyldiacetamide.,
Acta Chem. Scand., 1965, 19, 1079-1087, https://doi.org/10.3891/acta.chem.scand.19-1079
. [all data]
Wadso, 1965
Wadso, I.,
Thermochemical properties of diacetimide, N-butyldiacetimide and N-phenyldiacetimide,
Acta Chem. Scand., 1965, 19, 1079-1087. [all data]
Buckingham and Donaghy, 1982
Buckingham, J.; Donaghy, S.M.,
Dictionary of Organic Compounds: Fifth Edition, Chapman and Hall, New York, 1982, 1. [all data]
Stephenson and Malanowski, 1987
Stephenson, Richard M.; Malanowski, Stanislaw,
Handbook of the Thermodynamics of Organic Compounds, 1987, https://doi.org/10.1007/978-94-009-3173-2
. [all data]
Stull, 1947
Stull, Daniel R.,
Vapor Pressure of Pure Substances. Organic and Inorganic Compounds,
Ind. Eng. Chem., 1947, 39, 4, 517-540, https://doi.org/10.1021/ie50448a022
. [all data]
Davies, Jones, et al., 1959
Davies, M.; Jones, A.H.; Thomas, G.H.,
The lattice energies of the straight-chain primary amides,
Trans. Faraday Soc., 1959, 55, 1100. [all data]
Nikolic, Tripkovic, et al., 1989
Nikolic, R.; Tripkovic, J.; Kerridge, D.H.,
Phase chages in acetamide-salt systems: Melting points and latent heat of fusion of pure acetamide and acetamide-ammonium chloride,
Thermochim. Acta, 1989, 146, 353-360. [all data]
Domalski and Hearing, 1996
Domalski, Eugene S.; Hearing, Elizabeth D.,
Heat Capacities and Entropies of Organic Compounds in the Condensed Phase. Volume III,
J. Phys. Chem. Ref. Data, 1996, 25, 1, 1, https://doi.org/10.1063/1.555985
. [all data]
Klassen, Anderson, et al., 1996
Klassen, J.S.; Anderson, S.G.; Blades, A.T.; Kebarle, P.,
Reaction Enthalpies for M+L = M+ + L, Where M+ = Na+ and K+ and L = Acetamide, N-Methylacetamide, N,N-Dimethylacetamide, Glycine, and Glycylglycine, from Determinations of the Collision-Induced Dissociation Thresholds,
J. Phys. Chem., 1996, 100, 33, 14218, https://doi.org/10.1021/jp9608382
. [all data]