Urea, N,N-diphenyl-
- Formula: C13H12N2O
- Molecular weight: 212.2472
- IUPAC Standard InChIKey: XKAFKUGMXFMRCC-UHFFFAOYSA-N
- CAS Registry Number: 603-54-3
- Chemical structure:

Phase change data

Data compiled by: Thermodynamics Research Center, NIST Boulder Laboratories, Chris Muzny director
Quantity | Value | Units | Method | Reference | Comment |
---|---|---|---|---|---|
Tfus | 463.6 | K | N/A | Medard and Thomas, 1952 | Uncertainty assigned by TRC = 0.00001 K |

Reaction thermochemistry data

Data compiled by: Hussein Y. Afeefy, Joel F. Liebman, and Stephen E. Stein
Individual Reactions
By formula: C7H5NO + C6H7N = C13H12N2O
Quantity | Value | Units | Method | Reference | Comment |
---|---|---|---|---|---|
ΔrH° | -82.5 ± 2.0 | kJ/mol | Cm | Kiselev, Malkov, et al., 1989 | liquid phase; solvent: Dioxane |

Condensed phase thermochemistry data

Data compiled by: Hussein Y. Afeefy, Joel F. Liebman, and Stephen E. Stein
Quantity | Value | Units | Method | Reference | Comment |
---|---|---|---|---|---|
ΔfH°solid | -29.33 ± 0.81 | kcal/mol | Ccb | Medard and Thomas, 1952 | Reanalyzed by Cox and Pilcher, 1970, Original value = -26.4 kcal/mol; Author's hf291_condensed=-32.6 kcal/mol |
ΔfH°solid | -13.0 | kcal/mol | Ccb | Schmidt and Becker, 1933 | |
Quantity | Value | Units | Method | Reference | Comment |
ΔcH°solid | -1603.22 ± 0.80 | kcal/mol | Ccb | Medard and Thomas, 1952 | Reanalyzed by Cox and Pilcher, 1970, Original value = -1606.2 kcal/mol; Author's hf291_condensed=-32.6 kcal/mol |
ΔcH°solid | -1621.1 | kcal/mol | Ccb | Schmidt and Becker, 1933 |

References

Medard and Thomas, 1952
Medard, L.; Thomas, M.,
Meml. Poudres, 1952, 34, 421. [all data]
Kiselev, Malkov, et al., 1989
Kiselev, V.D.; Malkov, V.B.; Murzin, D.G.; Shakirov, I.M.; Konovalov, A.I.,
Thermochemical study of the reaction of isocyanate with amines,
Dokl. Phys. Chem. (Engl. Transl.), 1989, 308, 711-713, In original 111. [all data]