Ethyl N,N-diphenylcarbamate
- Formula: C15H15NO2
- Molecular weight: 241.2851
- IUPAC Standard InChIKey: HKTSLDUAGCAISP-UHFFFAOYSA-N
- CAS Registry Number: 603-52-1
- Chemical structure:
View 3d structure (requires JavaScript / HTML 5) - Other names: N,N-Diphenylurethane; N,N-Diphenylethyl carbamate; Carbamic acid, diphenyl-, ethyl ester; Diphenylcarbamic acid, ethyl ester; Diphenylurethane; Ethyl diphenylcarbamate; N,N-Diphenyl carbamic acid, ethyl ester

Condensed phase thermochemistry data

Data compiled by: Hussein Y. Afeefy, Joel F. Liebman, and Stephen E. Stein
Quantity | Value | Units | Method | Reference | Comment |
---|---|---|---|---|---|
ΔfH°solid | -281. ± 7.9 | kJ/mol | Ccb | Medard and Thomas, 1954 | Heat of combustion corrected for pressure |
ΔfH°solid | -261.2 | kJ/mol | Ccb | Medard, 1954 | Heat of combustion corrected for pressure |
ΔfH°solid | -290. | kJ/mol | Ccb | Schmidt and Becker, 1933 | |
Quantity | Value | Units | Method | Reference | Comment |
ΔcH°solid | -7765.5 ± 7.9 | kJ/mol | Ccb | Medard and Thomas, 1954 | Heat of combustion corrected for pressure |
ΔcH°solid | -7785.21 | kJ/mol | Ccb | Medard, 1954 | Heat of combustion corrected for pressure |
ΔcH°solid | -7740.4 | kJ/mol | Ccb | Schmidt and Becker, 1933 |

Phase change data

Data compiled by: Robert L. Brown and Stephen E. Stein
Quantity | Value | Units | Method | Reference | Comment |
---|---|---|---|---|---|
Tboil | 633.2 | K | N/A | Weast and Grasselli, 1989 |

References

Medard and Thomas, 1954
Medard, L.; Thomas, M.,
Chaleurs de combustion de vingt-quatre substances explosives ou apparentees a des explosifs,
Mem. Poudres, 1954, 36, 97-127. [all data]
Medard, 1954
Medard, L.,
Tables thermochimiques a l'usage des techniciens des substances explosives,
Mem. Artillerie Fr. Sci. Tech. Armement, 1954, 28, 415-492. [all data]
Schmidt and Becker, 1933
Schmidt, V.A.; Becker, F.,
Die Bildungswarme von Nitrocellulofen, Nitroglycerin und anderen widuigen Beltandteilen von Treibmitteln,
Z. Gesamte Schiess Sprengstoffwes., 1933, 33, 280-282. [all data]
Weast and Grasselli, 1989
CRC Handbook of Data on Organic Compounds, 2nd Editon, Weast,R.C and Grasselli, J.G., ed(s)., CRC Press, Inc., Boca Raton, FL, 1989, 1. [all data]