Benzene, 1,1',1''-methylidynetris[4-nitro-
- Formula: C19H13N3O6
- Molecular weight: 379.3230
- IUPAC Standard InChIKey: GFDFIMKBMBRKCK-UHFFFAOYSA-N
- CAS Registry Number: 603-49-6
- Chemical structure:
View 3d structure (requires JavaScript / HTML 5) - Other names: Tris(p-nitrophenyl)methane; Tris(4-nitrophenyl)methane; Tri-p-nitrophenylmethane; Trinitrotriphenylmethane

Condensed phase thermochemistry data

Data compiled by: Hussein Y. Afeefy, Joel F. Liebman, and Stephen E. Stein
Quantity | Value | Units | Method | Reference | Comment |
---|---|---|---|---|---|
ΔfH°solid | 175. | kJ/mol | Ccb | Schmidlin, 1906 | Author hf298_condensed=32.7 kcal/mol |
ΔfH°solid | 137. | kJ/mol | Ccb | Schmidin, 1904 | |
Quantity | Value | Units | Method | Reference | Comment |
ΔcH°solid | -9509.8 | kJ/mol | Ccb | Schmidlin, 1906 | Author hf298_condensed=32.7 kcal/mol |
ΔcH°solid | -9509.8 | kJ/mol | Ccb | Schmidin, 1904 |

References

Schmidlin, 1906
Schmidlin, M.J.,
Recherches chimiques et thermochimiques sur la constitution des rosanilines,
Ann. Chim. Phys., 1906, 1, 195-256. [all data]
Schmidin, 1904
Schmidin, M.J.,
Chaleurs de combustion du triphenylmethyle et de quelques derives du triphenylmethane,
Compt. Rend., 1904, 139, 732-733. [all data]