9,12-Octadecadienoic acid (Z,Z)-
- Formula: C18H32O2
- Molecular weight: 280.4455
- IUPAC Standard InChIKey: OYHQOLUKZRVURQ-HZJYTTRNSA-N
- CAS Registry Number: 60-33-3
- Chemical structure:
View 3d structure (requires JavaScript / HTML 5) - Stereoisomers:
- Other names: cis-9,cis-12-Octadecadienoic acid; cis,cis-Linoleic acid; Grape seed oil; Linoleic; Linoleic acid; Linolic acid; Polylin No. 515; Telfairic acid; Unifac 6550; 9,12-Octadecadienoic acid, cis,cis-; Leinoleic acid; 9,12-Linoleic acid; cis,cis-9,12-Octadecadienoic acid; Emersol 310; Emersol 315; Vespula pensylvanica b708568k063; 9-(Z), 12-(Z)-Octadecadienoic acid; Acide linoleique; Octadeca-9,12-dienoic acid, (cis,cis)-; (Z,Z)-9,12-Octadecadienoic acid; (Z,Z)-Octadeca-9, 12-dienoic acid; 9,12-Octadecadienoic acid (9Z,12Z)-; 9-cis,12-cis-Linoleic acid; 9Z,12Z-Linoleic acid; all-cis-9,12-Octadecadienoic acid; cis-Δ9,12-Octadecadienoic acid; Extra Linoleic 90; Polylin 515; 9,12-Octadecadienoic acid; Pamolyn 125 (Salt/Mix)

Condensed phase thermochemistry data

Data compiled by: Hussein Y. Afeefy, Joel F. Liebman, and Stephen E. Stein
Quantity | Value | Units | Method | Reference | Comment |
---|---|---|---|---|---|
ΔfH°liquid | -634.7 | kJ/mol | Chyd | Rogers, Hoyte, et al., 1978 |

Phase change data

Data compiled as indicated in comments:
BS - Robert L. Brown and Stephen E. Stein
TRC - Thermodynamics Research Center, NIST Boulder Laboratories, Chris Muzny director
Quantity | Value | Units | Method | Reference | Comment |
---|---|---|---|---|---|
Tfus | 266.4 | K | N/A | Brown and Frankel, 1938 | Uncertainty assigned by TRC = 0.8 K; TRC |
Tfus | 266.2 | K | N/A | Brown and Frankel, 1938 | Uncertainty assigned by TRC = 1. K; TRC |
Reduced pressure boiling point
Tboil (K) | Pressure (bar) | Reference | Comment |
---|---|---|---|
502.7 | 0.021 | Weast and Grasselli, 1989 | BS |

Reaction thermochemistry data

Data compiled by: Hussein Y. Afeefy, Joel F. Liebman, and Stephen E. Stein
Individual Reactions
By formula: 2H2 + C18H32O2 = C18H36O2
Quantity | Value | Units | Method | Reference | Comment |
---|---|---|---|---|---|
ΔrH° | -254.4 ± 1.5 | kJ/mol | Chyd | Rogers, Hoyte, et al., 1978 | liquid phase; solvent: Hexane |

Normal alkane RI, polar column, temperature ramp

Data compiled by: NIST Mass Spectrometry Data Center, William E. Wallace, director

Column type CapillaryCapillary
Active phase TC-WaxDB-Wax
Column length (m) 60.30.
Carrier gas HeHe
Substrate
Column diameter (mm) 0.250.25
Phase thickness (μm)
Tstart (C) 80.60.
Tend (C) 250.240.
Heat rate (K/min) 4.3.
Initial hold (min)  10.
Final hold (min) 47.
I 3215.3168.
ReferenceMiyazawa, Kurose, et al., 2001Hatsuko, Kazuko, et al., 1992
Comment MSDC-RI MSDC-RI

Van Den Dool and Kratz RI, non-polar column, custom temperature program

Data compiled by: NIST Mass Spectrometry Data Center, William E. Wallace, director

Column type Capillary
Active phase VF-5MS
Column length (m) 30.
Carrier gas He
Substrate
Column diameter (mm) 0.25
Phase thickness (μm) 0.25
Program Multi-step temperature program; T(initial)=60C; T(final)=270C
I 2145.8
ReferenceTret'yakov, 2007
Comment MSDC-RI

References

Rogers, Hoyte, et al., 1978
Rogers, D.W.; Hoyte, O.P.A.; Ho, R.K.C.,
Heats of hydrogenation of large molecules. Part 2. Six unsaturated and polyunsaturated fatty acids,
J. Chem. Soc. Faraday Trans. 1, 1978, 74, 46-52. [all data]
Brown and Frankel, 1938
Brown, J.B.; Frankel, J.,
Studies on the chemistry of the fatty acids: III. the properties of linoleic acids prepared by debromination and by low temperature crystallization, with a proposed method of quantitative estimation.,
J. Am. Chem. Soc., 1938, 60, 54. [all data]
Weast and Grasselli, 1989
CRC Handbook of Data on Organic Compounds, 2nd Editon, Weast,R.C and Grasselli, J.G., ed(s)., CRC Press, Inc., Boca Raton, FL, 1989, 1. [all data]