2-Heptanol, (R)-
- Formula: C7H16O
- Molecular weight: 116.2013
- IUPAC Standard InChIKey: CETWDUZRCINIHU-ZETCQYMHSA-N
- CAS Registry Number: 6033-24-5
- Chemical structure:
View 3d structure (requires JavaScript / HTML 5) - Stereoisomers:

Phase change data

Data compiled by: Robert L. Brown and Stephen E. Stein
Reduced pressure boiling point
Tboil (K) | Pressure (bar) | Reference |
---|---|---|
347.7 | 0.031 | Weast and Grasselli, 1989 |

References

Weast and Grasselli, 1989
CRC Handbook of Data on Organic Compounds, 2nd Editon, Weast,R.C and Grasselli, J.G., ed(s)., CRC Press, Inc., Boca Raton, FL, 1989, 1. [all data]