2-Heptanol, (S)-
- Formula: C7H16O
- Molecular weight: 116.2013
- IUPAC Standard InChIKey: CETWDUZRCINIHU-SSDOTTSWSA-N
- CAS Registry Number: 6033-23-4
- Chemical structure:
View 3d structure (requires JavaScript / HTML 5) - Stereoisomers:
- Other names: (S)-(+)-2-Heptanol

Phase change data

Data compiled as indicated in comments:
BS - Robert L. Brown and Stephen E. Stein
TRC - Thermodynamics Research Center, NIST Boulder Laboratories, Chris Muzny director
Quantity | Value | Units | Method | Reference | Comment |
---|---|---|---|---|---|
Tboil | 422.7 | K | N/A | Aldrich Chemical Company Inc., 1990 | BS |
Tboil | 431.4 | K | N/A | Prout and Spikner, 1962 | Uncertainty assigned by TRC = 3. K; TRC |
Tboil | 422.65 | K | N/A | Williams and Mosher, 1954 | Uncertainty assigned by TRC = 2. K; TRC |
Reduced pressure boiling point
Tboil (K) | Pressure (bar) | Reference | Comment |
---|---|---|---|
346.7 | 0.027 | Weast and Grasselli, 1989 | BS |

References

Aldrich Chemical Company Inc., 1990
Aldrich Chemical Company Inc.,
Catalog Handbook of Fine Chemicals, Aldrich Chemical Company, Inc., Milwaukee WI, 1990, 1. [all data]
Prout and Spikner, 1962
Prout; Spikner,
J. Org. Chem., 1962, 27, 1488. [all data]
Williams and Mosher, 1954
Williams, H.R.; Mosher, H.S.,
J. Am. Chem. Soc., 1954, 76, 3495. [all data]
Weast and Grasselli, 1989
CRC Handbook of Data on Organic Compounds, 2nd Editon, Weast,R.C and Grasselli, J.G., ed(s)., CRC Press, Inc., Boca Raton, FL, 1989, 1. [all data]