1,2,3-Trinitrobenzene
- Formula: C6H3N3O6
- Molecular weight: 213.1045
- IUPAC Standard InChIKey: ONOWMDPHGJEBAZ-UHFFFAOYSA-N
- CAS Registry Number: 603-13-4
- Chemical structure:
View 3d structure (requires JavaScript / HTML 5) - Permanent link for this species. Use this link for bookmarking this species for future reference.

Phase change data

Data compiled as indicated in comments:
TRC - Thermodynamics Research Center, NIST Boulder Laboratories, Chris Muzny director
AC - William E. Acree, Jr., James S. Chickos
Quantity | Value | Units | Method | Reference | Comment |
---|---|---|---|---|---|
Tfus | 402.2 | K | N/A | Castro, Andrews, et al., 1958 | Uncertainty assigned by TRC = 2. K; TRC |
Enthalpy of vaporization
ΔvapH (kJ/mol) | Temperature (K) | Method | Reference | Comment |
---|---|---|---|---|
60.3 | 538. | A | Stephenson and Malanowski, 1987 | Based on data from 523. to 573. K. See also Maksimov, 1968 and Dykyj, 1972.; AC |

References

Castro, Andrews, et al., 1958
Castro, C.E.; Andrews, L.J.; Keefer, R.M.,
Molecular Complexes of Hindered Biphenyl Derivatives,
J. Am. Chem. Soc., 1958, 80, 2322-6. [all data]
Stephenson and Malanowski, 1987
Stephenson, Richard M.; Malanowski, Stanislaw,
Handbook of the Thermodynamics of Organic Compounds, 1987, https://doi.org/10.1007/978-94-009-3173-2
. [all data]
Maksimov, 1968
Maksimov, Y.Y.,
Russ. J. Phys. Chem., 1968, 42, 11, 1550. [all data]
Dykyj, 1972
Dykyj, J.,
Petrochemia, 1972, 12, 1, 13. [all data]