2,4-Dinitro-1,3-dimethyl-benzene
- Formula: C8H8N2O4
- Molecular weight: 196.1601
- IUPAC Standard InChIKey: XUUSVHGZGPBZLS-UHFFFAOYSA-N
- CAS Registry Number: 603-02-1
- Chemical structure:

Condensed phase thermochemistry data

Data compiled by: Hussein Y. Afeefy, Joel F. Liebman, and Stephen E. Stein
Quantity | Value | Units | Method | Reference | Comment |
---|---|---|---|---|---|
ΔcH°solid | -1005.2 ± 1.0 | kcal/mol | Ccb | Badoche, 1939 | Reanalyzed by Cox and Pilcher, 1970, Original value = -1005.73 kcal/mol |

References

Badoche, 1939
Badoche, M.M.,
Determinations des chaleurs de combustion de derives nitres de la serie benzenique,
Bull. Soc. Chim. France, 1939, 6, 570-579. [all data]
Cox and Pilcher, 1970
Cox, J.D.; Pilcher, G.,
Thermochemistry of Organic and Organometallic Compounds, Academic Press, New York, 1970, 1-636. [all data]