3-Methyl-2,4,6-trinitro-phenol
- Formula: C7H5N3O7
- Molecular weight: 243.1305
- IUPAC Standard InChIKey: YYGJRRYSYLLCQH-UHFFFAOYSA-N
- CAS Registry Number: 602-99-3
- Chemical structure:
View 3d structure (requires JavaScript / HTML 5) - Other names: 2,4,6-Trinitro-m-cresol; Phenol, 3-methyl-2,4,6-trinitro-; m-Cresol, 2,4,6-trinitro-; Cresylite; Picric acid, methyl-; Picric acid, 3-methyl-; Trinitro-m-cresol; Trinitro-m-cresolic acid; 2,4,6-Trinitro-3-methylphenol; Trinitro-meta-cresol; UN 0216; 3-Methylpicric acid; Methylpicric acid; NSC 3182

Condensed phase thermochemistry data

Data compiled by: Hussein Y. Afeefy, Joel F. Liebman, and Stephen E. Stein
Quantity | Value | Units | Method | Reference | Comment |
---|---|---|---|---|---|
ΔcH°solid | -3212.7 ± 3.2 | kJ/mol | Ccb | Badoche, 1942 | Reanalyzed by Cox and Pilcher, 1970, Original value = -3216.3 kJ/mol |
ΔcH°solid | -3213.9 ± 3.2 | kJ/mol | Ccb | Burlot, 1939 | Reanalyzed by Cox and Pilcher, 1970, Original value = -3229.4 kJ/mol |

Phase change data

Data compiled by: William E. Acree, Jr., James S. Chickos
Quantity | Value | Units | Method | Reference | Comment |
---|---|---|---|---|---|
ΔsubH° | 111.2 ± 2.1 | kJ/mol | N/A | Cundall, Frank Palmer, et al., 1978 | Based on data from 310. to 365. K. |
ΔsubH° | 104.6 | kJ/mol | N/A | Lenchitz and Velicky, 1970 |
Enthalpy of sublimation
ΔsubH (kJ/mol) | Temperature (K) | Reference | Comment |
---|---|---|---|
103.3 | 337. | Lenchitz and Velicky, 1970 | Based on data from 325. to 350. K. |

References

Badoche, 1942
Badoche, M.,
Chaleurs de combustion de derives nitres phenoliques,
Bull. Soc. Chim. France, 1942, 9, 86-95. [all data]
Cox and Pilcher, 1970
Cox, J.D.; Pilcher, G.,
Thermochemistry of Organic and Organometallic Compounds, Academic Press, New York, 1970, 1-636. [all data]
Burlot, 1939
Burlot, E.,
Etude relative a la calorimetrie des explosifs,
Mem. Poudres, 1939, 29, 226-260. [all data]
Cundall, Frank Palmer, et al., 1978
Cundall, Robert B.; Frank Palmer, T.; Wood, Colin E.C.,
Vapour pressure measurements on some organic high explosives,
J. Chem. Soc., Faraday Trans. 1, 1978, 74, 0, 1339, https://doi.org/10.1039/f19787401339
. [all data]
Lenchitz and Velicky, 1970
Lenchitz, Charles; Velicky, Rodolf W.,
Vapor pressure and heat of sublimation of three nitrotoluenes,
J. Chem. Eng. Data, 1970, 15, 3, 401-403, https://doi.org/10.1021/je60046a022
. [all data]