Ethyl ether
- Formula: C4H10O
- Molecular weight: 74.1216
- IUPAC Standard InChIKey: RTZKZFJDLAIYFH-UHFFFAOYSA-N
- CAS Registry Number: 60-29-7
- Chemical structure:
View 3d structure (requires JavaScript / HTML 5) - Other names: Ethane, 1,1'-oxybis-; Anaesthetic ether; Anesthesia ether; Anesthetic ether; Diethyl ether; Diethyl oxide; Ethoxyethane; Pronarcol; Solvent ether; 1,1'-Oxybisethane; (C2H5)2O; Aether; Diaethylaether; Dwuetylowy eter; Etere etilico; Ether ethylique; Ether, ethyl; Ethyl ether, tech.; Ethyl oxide; Oxyde d'ethyle; Rcra waste number U117; UN 1155; 3-Oxapentane; Ether; Ethyl ether anhydrous A.C.S.; Sulfuric ether; NSC 100036

Gas phase thermochemistry data

Data compiled as indicated in comments:
ALS - Hussein Y. Afeefy, Joel F. Liebman, and Stephen E. Stein
GT - Glushko Thermocenter, Russian Academy of Sciences, Moscow
Quantity | Value | Units | Method | Reference | Comment |
---|---|---|---|---|---|
ΔfH°gas | -252.7 ± 2.0 | kJ/mol | Ccb | Pihlaja and Heikkil, 1968 | Reanalyzed by Pedley, Naylor, et al., 1986, Original value = -250.3 ± 1.8 kJ/mol; ALS |
ΔfH°gas | -252.2 ± 0.79 | kJ/mol | Cm | Pilcher, Skinner, et al., 1963 | ALS |
ΔfH°gas | -244. | kJ/mol | Ccb | Murrin and Goldhagen, 1957 | ALS |
Quantity | Value | Units | Method | Reference | Comment |
ΔcH°gas | -2726.3 ± 1.8 | kJ/mol | Ccb | Pihlaja and Heikkil, 1968 | Corresponding ΔfHºgas = -276.9 kJ/mol (simple calculation by NIST; no Washburn corrections); ALS |
ΔcH°gas | -2751.1 ± 0.75 | kJ/mol | Cm | Pilcher, Skinner, et al., 1963 | Corresponding ΔfHºgas = -252.1 kJ/mol (simple calculation by NIST; no Washburn corrections); ALS |
Quantity | Value | Units | Method | Reference | Comment |
S°gas | 342.2 | J/mol*K | N/A | Counsell J.F., 1971 | Other third-law entropy values at 298.15 K are 342.46 [ Cope C.S., 1959], 342.33 [ Stull D.R., 1969], and 342.60 J/mol*K [ Chao J., 1986].; GT |
Constant pressure heat capacity of gas
Cp,gas (J/mol*K) | Temperature (K) | Reference | Comment |
---|---|---|---|
62.50 | 100. | Chao J., 1986 | p=1 bar.; GT |
84.80 | 150. | ||
99.70 | 200. | ||
114.30 | 273.15 | ||
119.46 ± 0.15 | 298.15 | ||
119.86 | 300. | ||
142.81 | 400. | ||
165.77 | 500. | ||
186.35 | 600. | ||
204.35 | 700. | ||
220.04 | 800. | ||
233.74 | 900. | ||
245.68 | 1000. | ||
256.08 | 1100. | ||
265.12 | 1200. | ||
272.97 | 1300. | ||
279.81 | 1400. | ||
285.76 | 1500. |
Constant pressure heat capacity of gas
Cp,gas (J/mol*K) | Temperature (K) | Reference | Comment |
---|---|---|---|
121.94 | 309.98 | Counsell J.F., 1971 | Other experimental values of heat capacity [ Jennings W.H., 1934, Jatkar S.K.K., 1939, Valentin F.H.H., 1950] are believed to be less reliable (see [ Chao J., 1986]).; GT |
126.57 | 329.99 | ||
131.32 | 350.00 | ||
137.21 | 375.00 | ||
143.27 | 400.01 | ||
149.10 | 424.99 | ||
155.11 | 450.04 |

Reaction thermochemistry data

Data compiled as indicated in comments:
M - Michael M. Meot-Ner (Mautner) and Sharon G. Lias
ALS - Hussein Y. Afeefy, Joel F. Liebman, and Stephen E. Stein
RCD - Robert C. Dunbar
B - John E. Bartmess
Individual Reactions
By formula: C4H11O+ + C4H10O = (C4H11O+ • C4H10O)
Bond type: Hydrogen bonds of the type OH-O between organics
Quantity | Value | Units | Method | Reference | Comment |
---|---|---|---|---|---|
ΔrH° | 131. | kJ/mol | PHPMS | Szulejko and McMahon, 1991 | gas phase; M |
ΔrH° | 127. | kJ/mol | ICR | Larson and McMahon, 1982 | gas phase; switching reaction((CH3)2OH+)(CH3)2O, Entropy change calculated or estimated; Grimsrud and Kebarle, 1973, Lias, Liebman, et al., 1984, Keesee and Castleman, 1986; M |
Quantity | Value | Units | Method | Reference | Comment |
ΔrS° | 160. | J/mol*K | PHPMS | Szulejko and McMahon, 1991 | gas phase; M |
ΔrS° | 129. | J/mol*K | N/A | Larson and McMahon, 1982 | gas phase; switching reaction((CH3)2OH+)(CH3)2O, Entropy change calculated or estimated; Grimsrud and Kebarle, 1973, Lias, Liebman, et al., 1984, Keesee and Castleman, 1986; M |
Quantity | Value | Units | Method | Reference | Comment |
ΔrG° | 88.3 | kJ/mol | ICR | Larson and McMahon, 1982 | gas phase; switching reaction((CH3)2OH+)(CH3)2O, Entropy change calculated or estimated; Grimsrud and Kebarle, 1973, Lias, Liebman, et al., 1984, Keesee and Castleman, 1986; M |
By formula: C5H11O+ + C4H10O = (C5H11O+ • C4H10O)
Bond type: Hydrogen bonds of the type OH-O between organics
Quantity | Value | Units | Method | Reference | Comment |
---|---|---|---|---|---|
ΔrH° | 123. | kJ/mol | ICR | Larson and McMahon, 1982 | gas phase; switching reaction((CH3)2OH+)(CH3)2O, Entropy change calculated or estimated; Grimsrud and Kebarle, 1973, Lias, Liebman, et al., 1984, Keesee and Castleman, 1986; M |
Quantity | Value | Units | Method | Reference | Comment |
ΔrS° | 123. | J/mol*K | N/A | Larson and McMahon, 1982 | gas phase; switching reaction((CH3)2OH+)(CH3)2O, Entropy change calculated or estimated; Grimsrud and Kebarle, 1973, Lias, Liebman, et al., 1984, Keesee and Castleman, 1986; M |
Quantity | Value | Units | Method | Reference | Comment |
ΔrG° | 86.6 | kJ/mol | ICR | Larson and McMahon, 1982 | gas phase; switching reaction((CH3)2OH+)(CH3)2O, Entropy change calculated or estimated; Grimsrud and Kebarle, 1973, Lias, Liebman, et al., 1984, Keesee and Castleman, 1986; M |
By formula: C6H15O+ + C4H10O = (C6H15O+ • C4H10O)
Bond type: Hydrogen bonds of the type OH-O between organics
Quantity | Value | Units | Method | Reference | Comment |
---|---|---|---|---|---|
ΔrH° | 123. | kJ/mol | ICR | Larson and McMahon, 1982 | gas phase; switching reaction((CH3)2OH+)(CH3)2O, Entropy change calculated or estimated; Grimsrud and Kebarle, 1973, Lias, Liebman, et al., 1984, Keesee and Castleman, 1986; M |
Quantity | Value | Units | Method | Reference | Comment |
ΔrS° | 126. | J/mol*K | N/A | Larson and McMahon, 1982 | gas phase; switching reaction((CH3)2OH+)(CH3)2O, Entropy change calculated or estimated; Grimsrud and Kebarle, 1973, Lias, Liebman, et al., 1984, Keesee and Castleman, 1986; M |
Quantity | Value | Units | Method | Reference | Comment |
ΔrG° | 85.4 | kJ/mol | ICR | Larson and McMahon, 1982 | gas phase; switching reaction((CH3)2OH+)(CH3)2O, Entropy change calculated or estimated; Grimsrud and Kebarle, 1973, Lias, Liebman, et al., 1984, Keesee and Castleman, 1986; M |
By formula: C6H15O+ + C4H10O = (C6H15O+ • C4H10O)
Bond type: Hydrogen bonds of the type OH-O between organics
Quantity | Value | Units | Method | Reference | Comment |
---|---|---|---|---|---|
ΔrH° | 109. | kJ/mol | ICR | Larson and McMahon, 1982 | gas phase; switching reaction((CH3)2OH+)(CH3)2O, Entropy change calculated or estimated; Grimsrud and Kebarle, 1973, Lias, Liebman, et al., 1984, Keesee and Castleman, 1986; M |
Quantity | Value | Units | Method | Reference | Comment |
ΔrS° | 129. | J/mol*K | N/A | Larson and McMahon, 1982 | gas phase; switching reaction((CH3)2OH+)(CH3)2O, Entropy change calculated or estimated; Grimsrud and Kebarle, 1973, Lias, Liebman, et al., 1984, Keesee and Castleman, 1986; M |
Quantity | Value | Units | Method | Reference | Comment |
ΔrG° | 70.3 | kJ/mol | ICR | Larson and McMahon, 1982 | gas phase; switching reaction((CH3)2OH+)(CH3)2O, Entropy change calculated or estimated; Grimsrud and Kebarle, 1973, Lias, Liebman, et al., 1984, Keesee and Castleman, 1986; M |
By formula: C3H9Si+ + C4H10O = (C3H9Si+ • C4H10O)
Quantity | Value | Units | Method | Reference | Comment |
---|---|---|---|---|---|
ΔrH° | 185. | kJ/mol | PHPMS | Wojtyniak and Stone, 1986 | gas phase; switching reaction,Thermochemical ladder((CH3)3Si+)H2O, Entropy change calculated or estimated; M |
Quantity | Value | Units | Method | Reference | Comment |
ΔrS° | 125. | J/mol*K | N/A | Wojtyniak and Stone, 1986 | gas phase; switching reaction,Thermochemical ladder((CH3)3Si+)H2O, Entropy change calculated or estimated; M |
Free energy of reaction
ΔrG° (kJ/mol) | T (K) | Method | Reference | Comment |
---|---|---|---|---|
127. | 468. | PHPMS | Wojtyniak and Stone, 1986 | gas phase; switching reaction,Thermochemical ladder((CH3)3Si+)H2O, Entropy change calculated or estimated; M |
By formula: C6H14N+ + C4H10O = (C6H14N+ • C4H10O)
Bond type: Hydrogen bonds of the type NH+-O between organics
Quantity | Value | Units | Method | Reference | Comment |
---|---|---|---|---|---|
ΔrH° | 92.0 | kJ/mol | PHPMS | Meot-Ner, 1984 | gas phase; M |
ΔrH° | 91.6 | kJ/mol | PHPMS | Meot-Ner (Mautner), 1983 | gas phase; M |
Quantity | Value | Units | Method | Reference | Comment |
ΔrS° | 133. | J/mol*K | PHPMS | Meot-Ner, 1984 | gas phase; M |
ΔrS° | 133. | J/mol*K | PHPMS | Meot-Ner (Mautner), 1983 | gas phase; M |
By formula: CH6N+ + C4H10O = (CH6N+ • C4H10O)
Bond type: Hydrogen bonds of the type NH+-O between organics
Quantity | Value | Units | Method | Reference | Comment |
---|---|---|---|---|---|
ΔrH° | 92.0 | kJ/mol | PHPMS | Meot-Ner, 1984 | gas phase; M |
ΔrH° | 92.0 | kJ/mol | PHPMS | Meot-Ner (Mautner), 1983 | gas phase; M |
Quantity | Value | Units | Method | Reference | Comment |
ΔrS° | 105. | J/mol*K | PHPMS | Meot-Ner, 1984 | gas phase; M |
ΔrS° | 105. | J/mol*K | PHPMS | Meot-Ner (Mautner), 1983 | gas phase; M |
By formula: C4H8O + H2 = C4H10O
Quantity | Value | Units | Method | Reference | Comment |
---|---|---|---|---|---|
ΔrH° | -110.9 ± 0.59 | kJ/mol | Chyd | Allinger, Glaser, et al., 1981 | liquid phase; solvent: Hexane; ALS |
ΔrH° | -110.8 ± 0.3 | kJ/mol | Chyd | Dolliver, Gresham, et al., 1938 | gas phase; Reanalyzed by Cox and Pilcher, 1970, Original value = -112. ± 3. kJ/mol; At 355°K; ALS |
By formula: Na+ + C4H10O = (Na+ • C4H10O)
Quantity | Value | Units | Method | Reference | Comment |
---|---|---|---|---|---|
ΔrH° | 130. ± 1. | kJ/mol | HPMS | Guo, Conklin, et al., 1989 | gas phase; M |
Quantity | Value | Units | Method | Reference | Comment |
ΔrS° | 118. | J/mol*K | HPMS | Guo, Conklin, et al., 1989 | gas phase; M |
Free energy of reaction
ΔrG° (kJ/mol) | T (K) | Method | Reference | Comment |
---|---|---|---|---|
89.1 | 298. | IMRE | McMahon and Ohanessian, 2000 | Anchor alanine=39.89; RCD |
By formula: C5H6N+ + C4H10O = (C5H6N+ • C4H10O)
Bond type: Hydrogen bonds of the type NH+-O between organics
Quantity | Value | Units | Method | Reference | Comment |
---|---|---|---|---|---|
ΔrH° | 94.1 | kJ/mol | PHPMS | Meot-Ner (Mautner), 1983 | gas phase; M |
Quantity | Value | Units | Method | Reference | Comment |
ΔrS° | 138. | J/mol*K | PHPMS | Meot-Ner (Mautner), 1983 | gas phase; M |
By formula: NO- + C4H10O = (NO- • C4H10O)
Quantity | Value | Units | Method | Reference | Comment |
---|---|---|---|---|---|
ΔrH° | 173. | kJ/mol | ICR | Reents and Freiser, 1981 | gas phase; switching reaction,Thermochemical ladder(NO+)C2H5OH, Entropy change calculated or estimated; Farid and McMahon, 1978; M |
By formula: C4H6O + 2H2 = C4H10O
Quantity | Value | Units | Method | Reference | Comment |
---|---|---|---|---|---|
ΔrH° | -237.4 ± 0.42 | kJ/mol | Chyd | Dolliver, Gresham, et al., 1938 | gas phase; Reanalyzed by Cox and Pilcher, 1970, Original value = -239.5 ± 0.4 kJ/mol; At 355°K; ALS |
+
= C4H10ClO-
By formula: Cl- + C4H10O = C4H10ClO-
Quantity | Value | Units | Method | Reference | Comment |
---|---|---|---|---|---|
ΔrH° | 37.7 ± 1.7 | kJ/mol | TDAs | Bogdanov, Lee, et al., 2001 | gas phase; B |
Quantity | Value | Units | Method | Reference | Comment |
ΔrG° | 14. ± 4.2 | kJ/mol | TDAs | Bogdanov, Lee, et al., 2001 | gas phase; B |
By formula: (Na+ • 2C4H10O) + C4H10O = (Na+ • 3C4H10O)
Quantity | Value | Units | Method | Reference | Comment |
---|---|---|---|---|---|
ΔrH° | 69. ± 1. | kJ/mol | HPMS | Guo, Conklin, et al., 1989 | gas phase; M |
Quantity | Value | Units | Method | Reference | Comment |
ΔrS° | 123. | J/mol*K | HPMS | Guo, Conklin, et al., 1989 | gas phase; M |
By formula: (Na+ • C4H10O) + C4H10O = (Na+ • 2C4H10O)
Quantity | Value | Units | Method | Reference | Comment |
---|---|---|---|---|---|
ΔrH° | 96. ± 1. | kJ/mol | HPMS | Guo, Conklin, et al., 1989 | gas phase; M |
Quantity | Value | Units | Method | Reference | Comment |
ΔrS° | 117. | J/mol*K | HPMS | Guo, Conklin, et al., 1989 | gas phase; M |
By formula: K+ + C4H10O = (K+ • C4H10O)
Quantity | Value | Units | Method | Reference | Comment |
---|---|---|---|---|---|
ΔrH° | 93.3 | kJ/mol | HPMS | Davidson and Kebarle, 1976 | gas phase; M |
Quantity | Value | Units | Method | Reference | Comment |
ΔrS° | 103. | J/mol*K | HPMS | Davidson and Kebarle, 1976 | gas phase; M |
By formula: Mg+ + C4H10O = (Mg+ • C4H10O)
Quantity | Value | Units | Method | Reference | Comment |
---|---|---|---|---|---|
ΔrH° | 280. ± 20. | kJ/mol | ICR | Operti, Tews, et al., 1988 | gas phase; switching reaction,Thermochemical ladder(Mg+)CH3OH; M |
By formula: 2C2H6O = C4H10O + H2O
Quantity | Value | Units | Method | Reference | Comment |
---|---|---|---|---|---|
ΔrH° | -24.0 ± 0.1 | kJ/mol | Eqk | Connett, 1972 | gas phase; ALS |

Henry's Law data

Data compiled by: Rolf Sander
Henry's Law constant (water solution)
kH(T) = k°H exp(d(ln(kH))/d(1/T) ((1/T) - 1/(298.15 K)))
k°H = Henry's law constant for solubility in water at 298.15 K (mol/(kg*bar))
d(ln(kH))/d(1/T) = Temperature dependence constant (K)
k°H (mol/(kg*bar)) | d(ln(kH))/d(1/T) (K) | Method | Reference | Comment |
---|---|---|---|---|
1.2 | M | N/A | ||
0.77 | Q | N/A | Several references are given in the list of Henry's law constants but not assigned to specific species. | |
0.78 | 5300. | X | N/A | |
0.79 | M | N/A | ||
1.1 | V | N/A | ||
1.1 | V | N/A |

Kovats' RI, non-polar column, isothermal

Column type | Active phase | Temperature (C) | I | Reference | Comment |
---|---|---|---|---|---|
Packed | OV-1 | 130. | 495. | Gurevich and Roshchina, 2003 | He or N2, Gas-Chrom Q |
Packed | SE-30 | 100. | 496. | Winskowski, 1983 | Gaschrom Q; Column length: 2. m |
Packed | Squalane | 50. | 478. | Becerra, Sánchez, et al., 1982 | N2, Chromosorb W-AM; Column length: 6. m |
Packed | Porapack Q | 200. | 486. | Goebel, 1982 | N2 |
Packed | Apiezon L | 120. | 473. | Bogoslovsky, Anvaer, et al., 1978 | Celite 545 |
Packed | Apiezon L | 160. | 471. | Bogoslovsky, Anvaer, et al., 1978 | Celite 545 |
Packed | Apiezon L | 70. | 476. | Bogoslovsky, Anvaer, et al., 1978 | |
Packed | Apolane | 70. | 482.6 | Riedo, Fritz, et al., 1976 | He, Chromosorb; Column length: 2.4 m |
Packed | Apiezon M | 130. | 476. | Golovnya and Garbuzov, 1974 | N2, Chromosorb W; Column length: 2.1 m |
Packed | Squalane | 50. | 474. | Vernon, 1971 | N2 |
Packed | Silicon High Vacuum Grease (obsolete) | 90. | 480. | Jonas, Janák, et al., 1966 | H2 |
Packed | Apiezon L | 130. | 484. | Wehrli and Kováts, 1959 | Celite; Column length: 2.25 m |
Packed | Apiezon L | 70. | 476. | Wehrli and Kováts, 1959 | Celite; Column length: 2.25 m |

Kovats' RI, polar column, isothermal

Column type | Active phase | Temperature (C) | I | Reference | Comment |
---|---|---|---|---|---|
Packed | Carbowax 20M | 75. | 630. | Goebel, 1982 | N2, Kieselgur (60-100 mesh); Column length: 2. m |
Packed | PEG-2000 | 120. | 577. | Anderson, Jurel, et al., 1973 | He, Celite 545 (44-60 mesh); Column length: 3. m |
Packed | PEG-2000 | 150. | 570. | Anderson, Jurel, et al., 1973 | He, Celite 545 (44-60 mesh); Column length: 3. m |
Packed | PEG-2000 | 152. | 577. | Anderson, Jurel, et al., 1973 | He, Celite 545 (44-60 mesh); Column length: 3. m |
Packed | PEG-2000 | 179. | 570. | Anderson, Jurel, et al., 1973 | He, Celite 545 (44-60 mesh); Column length: 3. m |
Packed | PEG-2000 | 180. | 567. | Anderson, Jurel, et al., 1973 | He, Celite 545 (44-60 mesh); Column length: 3. m |
Packed | PEG-2000 | 200. | 567. | Anderson, Jurel, et al., 1973 | He, Celite 545 (44-60 mesh); Column length: 3. m |

Kovats' RI, polar column, temperature ramp

Column type | Active phase | I | Reference | Comment |
---|---|---|---|---|
Capillary | CBP-20 | 576. | Shimadzu, 2003 | 25. m/0.2 mm/0.25 μm, He, 50. C @ 5. min, 4. K/min; Tend: 200. C |

Van Den Dool and Kratz RI, polar column, temperature ramp

Column type | Active phase | I | Reference | Comment |
---|---|---|---|---|
Capillary | Carbowax 20M | 596. | Chen, Kuo, et al., 1982 | He, 50. C @ 10. min, 1. K/min; Tend: 160. C |

Normal alkane RI, non-polar column, isothermal

Column type | Active phase | Temperature (C) | I | Reference | Comment |
---|---|---|---|---|---|
Capillary | DB-1 | 60. | 500. | Shimadzu, 2003, 2 | 60. m/0.32 mm/1. μm, He |
Packed | Synachrom | 150. | 493. | Dufka, Malinsky, et al., 1971 | Helium, Synachrom (60-80 mesh); Column length: 1.5 m |
Packed | Synachrom | 150. | 494. | Dufka, Malinsky, et al., 1971 | Helium, Synachrom (60-80 mesh); Column length: 1.5 m |
Packed | Squalane | 100. | 464. | Vernon, 1971 | N2 |

Normal alkane RI, non-polar column, temperature ramp

Column type | Active phase | I | Reference | Comment |
---|---|---|---|---|
Capillary | HP-5 MS | 510. | Kotowska, Zalikowski, et al., 2012 | 30. m/0.25 mm/0.25 μm, Helium, 35. C @ 5. min, 3. K/min, 300. C @ 15. min |
Capillary | OV-101 | 485. | Zenkevich, Eliseenkov, et al., 2011 | 25. m/0.20 mm/0.25 μm, Nitrogen, 6. K/min; Tstart: 40. C; Tend: 220. C |
Capillary | DB-5 | 485. | Savel'eva, Zenkevich, et al., 2003 | 25. m/0.20 mm/0.33 μm, Helium, 40. C @ 1. min, 5. K/min, 270. C @ 15. min |
Capillary | DB-1 | 504. | Habu, Flath, et al., 1985 | 3. K/min; Column length: 50. m; Column diameter: 0.32 mm; Tstart: 0. C; Tend: 250. C |

Normal alkane RI, non-polar column, custom temperature program

Column type | Active phase | I | Reference | Comment |
---|---|---|---|---|
Capillary | HP-5 MS | 509. | Kotowska, Zalikowski, et al., 2012 | 30. m/0.25 mm/0.25 μm, Helium; Program: not specified |
Capillary | HP-5 | 508. | Rotsatschakul, Visesanguan, et al., 2009 | 60. m/0.25 mm/0.25 μm, Helium; Program: 30 0C (2 min) 2 0Cmin -> 60 0C 10 0C/min -> 100 0C 20 0C/min -> 140 0C 10 0C/min -> 200 0C (10 min) |
Capillary | HP-5 | 504. | Garcia-Estaban, Ansorena, et al., 2004 | 50. m/0.32 mm/1.05 μm; Program: 40C(10min) => 5C/min => 200C => 20C/min => 250C(5min) |
Capillary | DB-5 | 504. | Garcia-Estaban, Ansorena, et al., 2004, 2 | 50. m/0.32 mm/1.05 μm; Program: 40C(10min) => 5C/min => 200C => 20C/min => 250C (5min) |
Capillary | Methyl Silicone | 484. | N/A | Program: not specified |
Capillary | SPB-1 | 499. | Flanagan, Streete, et al., 1997 | 60. m/0.53 mm/5. μm, He; Program: 40C(6min) => 5C/min => 80C => 10C/min => 200C |
Capillary | Polydimethyl siloxanes | 485. | Zenkevich, 1997 | Program: not specified |
Capillary | Polydimethyl siloxanes | 485. | Zenkevich, Chupalov, et al., 1996 | Program: not specified |
Capillary | SPB-1 | 499. | Strete, Ruprah, et al., 1992 | 60. m/0.53 mm/5.0 μm, Helium; Program: 40 0C (6 min) 5 0C/min -> 80 0C 10 0C/min -> 200 0C |
Capillary | SPB-1 | 515. | Strete, Ruprah, et al., 1992 | 60. m/0.53 mm/5.0 μm, Helium; Program: not specified |
Capillary | DB-1 | 470. | Kawai, Ishida, et al., 1991 | 60. m/0.25 mm/0.25 μm; Program: not specified |
Capillary | DB-1 | 477. | Kawai, Ishida, et al., 1991 | 60. m/0.25 mm/0.25 μm; Program: not specified |

Normal alkane RI, polar column, isothermal

Column type | Active phase | Temperature (C) | I | Reference | Comment |
---|---|---|---|---|---|
Capillary | Carbowax 20M | 100. | 608. | Sun, Siepmann, et al., 2006 | 30. m/0.25 mm/0.25 μm, Helium |
Capillary | Carbowax 20M | 120. | 606. | Sun, Siepmann, et al., 2006 | 30. m/0.25 mm/0.25 μm, Helium |
Capillary | Carbowax 20M | 60. | 618. | Sun, Siepmann, et al., 2006 | 30. m/0.25 mm/0.25 μm, Helium |
Capillary | Carbowax 20M | 80. | 619. | Sun, Siepmann, et al., 2006 | 30. m/0.25 mm/0.25 μm, Helium |

Normal alkane RI, polar column, temperature ramp

Column type | Active phase | I | Reference | Comment |
---|---|---|---|---|
Capillary | Carbowax 20M | 640. | Labropoulos, Palmer, et al., 1982 | Helium, 10. K/min; Column length: 31. m; Column diameter: 0.50 mm; Tstart: 40. C; Tend: 200. C |

Normal alkane RI, polar column, custom temperature program

Column type | Active phase | I | Reference | Comment |
---|---|---|---|---|
Capillary | Carbowax 20M | 590. | Vinogradov, 2004 | Program: not specified |
Capillary | DB-Wax | 616. | Peng, Yang, et al., 1991 | Program: not specified |

Gas phase ion energetics data

Data evaluated as indicated in comments:
HL - Edward P. Hunter and Sharon G. Lias
L - Sharon G. Lias
Data compiled as indicated in comments:
LBLHLM - Sharon G. Lias, John E. Bartmess, Joel F. Liebman, John L. Holmes, Rhoda D. Levin, and W. Gary Mallard
LLK - Sharon G. Lias, Rhoda D. Levin, and Sherif A. Kafafi
RDSH - Henry M. Rosenstock, Keith Draxl, Bruce W. Steiner, and John T. Herron
Quantity | Value | Units | Method | Reference | Comment |
---|---|---|---|---|---|
IE (evaluated) | 9.51 ± 0.03 | eV | N/A | N/A | L |
Quantity | Value | Units | Method | Reference | Comment |
Proton affinity (review) | 828.4 | kJ/mol | N/A | Hunter and Lias, 1998 | HL |
Quantity | Value | Units | Method | Reference | Comment |
Gas basicity | 801. | kJ/mol | N/A | Hunter and Lias, 1998 | HL |
Ionization energy determinations
IE (eV) | Method | Reference | Comment |
---|---|---|---|
9.52 ± 0.07 | EI | Bowen and Maccoll, 1984 | LBLHLM |
9.60 ± 0.01 | PI | Botter, Pechine, et al., 1977 | LLK |
9.41 | PE | Behan, Dean, et al., 1976 | LLK |
9.50 ± 0.01 | PE | Cocksey, Eland, et al., 1971 | LLK |
9.51 | PE | Dewar and Worley, 1969 | RDSH |
9.53 ± 0.02 | PI | Watanabe, 1957 | RDSH |
9.61 | PE | Ohno, Imai, et al., 1985 | Vertical value; LBLHLM |
9.66 | PE | Aue and Bowers, 1979 | Vertical value; LLK |
9.59 | PE | Benoit and Harrison, 1977 | Vertical value; LLK |
9.701 | PE | Aue, Webb, et al., 1975 | Vertical value; LLK |
Appearance energy determinations
Ion | AE (eV) | Other Products | Method | Reference | Comment |
---|---|---|---|---|---|
CH3O+ | 12.28 ± 0.05 | C2H4+CH3 | EI | Selim and Helal, 1981 | LLK |
CH3O+ | 11.92 | ? | EI | Holmes, Rye, et al., 1979 | LLK |
CH3O+ | 12.1 | ? | EI | Harrison, Ivko, et al., 1966 | RDSH |
C2H5+ | 12.0 ± 0.1 | ? | EI | Williams and Hamill, 1968 | RDSH |
C2H5O+ | 11.85 | C2H5 | EI | Lossing, 1977 | LLK |
C2H5O+ | 11.83 | C2H5 | EI | Phillips, Russell, et al., 1975 | LLK |
C2H5O+ | 11.8 | C2H5 | EI | Harrison, Ivko, et al., 1966 | RDSH |
C3H5+ | 11.6 | ? | EI | Tsang and Harrison, 1970 | RDSH |
C3H7O+ | 10.26 ± 0.08 | CH3 | EI | Bowen and Maccoll, 1984 | LBLHLM |
C3H7O+ | 10.26 | CH3 | EI | Lossing, 1977 | LLK |
C3H7O+ | 10.3 | CH3 | EI | Harrison, Ivko, et al., 1966 | RDSH |

Ion clustering data

Data compiled as indicated in comments:
M - Michael M. Meot-Ner (Mautner) and Sharon G. Lias
B - John E. Bartmess
RCD - Robert C. Dunbar
Clustering reactions
By formula: CH6N+ + C4H10O = (CH6N+ • C4H10O)
Bond type: Hydrogen bonds of the type NH+-O between organics
Quantity | Value | Units | Method | Reference | Comment |
---|---|---|---|---|---|
ΔrH° | 92.0 | kJ/mol | PHPMS | Meot-Ner, 1984 | gas phase; M |
ΔrH° | 92.0 | kJ/mol | PHPMS | Meot-Ner (Mautner), 1983 | gas phase; M |
Quantity | Value | Units | Method | Reference | Comment |
ΔrS° | 105. | J/mol*K | PHPMS | Meot-Ner, 1984 | gas phase; M |
ΔrS° | 105. | J/mol*K | PHPMS | Meot-Ner (Mautner), 1983 | gas phase; M |
By formula: C3H9Si+ + C4H10O = (C3H9Si+ • C4H10O)
Quantity | Value | Units | Method | Reference | Comment |
---|---|---|---|---|---|
ΔrH° | 185. | kJ/mol | PHPMS | Wojtyniak and Stone, 1986 | gas phase; switching reaction,Thermochemical ladder((CH3)3Si+)H2O, Entropy change calculated or estimated; M |
Quantity | Value | Units | Method | Reference | Comment |
ΔrS° | 125. | J/mol*K | N/A | Wojtyniak and Stone, 1986 | gas phase; switching reaction,Thermochemical ladder((CH3)3Si+)H2O, Entropy change calculated or estimated; M |
Free energy of reaction
ΔrG° (kJ/mol) | T (K) | Method | Reference | Comment |
---|---|---|---|---|
127. | 468. | PHPMS | Wojtyniak and Stone, 1986 | gas phase; switching reaction,Thermochemical ladder((CH3)3Si+)H2O, Entropy change calculated or estimated; M |
By formula: C4H11O+ + C4H10O = (C4H11O+ • C4H10O)
Bond type: Hydrogen bonds of the type OH-O between organics
Quantity | Value | Units | Method | Reference | Comment |
---|---|---|---|---|---|
ΔrH° | 131. | kJ/mol | PHPMS | Szulejko and McMahon, 1991 | gas phase; M |
ΔrH° | 127. | kJ/mol | ICR | Larson and McMahon, 1982 | gas phase; switching reaction((CH3)2OH+)(CH3)2O, Entropy change calculated or estimated; Grimsrud and Kebarle, 1973, Lias, Liebman, et al., 1984, Keesee and Castleman, 1986; M |
Quantity | Value | Units | Method | Reference | Comment |
ΔrS° | 160. | J/mol*K | PHPMS | Szulejko and McMahon, 1991 | gas phase; M |
ΔrS° | 129. | J/mol*K | N/A | Larson and McMahon, 1982 | gas phase; switching reaction((CH3)2OH+)(CH3)2O, Entropy change calculated or estimated; Grimsrud and Kebarle, 1973, Lias, Liebman, et al., 1984, Keesee and Castleman, 1986; M |
Quantity | Value | Units | Method | Reference | Comment |
ΔrG° | 88.3 | kJ/mol | ICR | Larson and McMahon, 1982 | gas phase; switching reaction((CH3)2OH+)(CH3)2O, Entropy change calculated or estimated; Grimsrud and Kebarle, 1973, Lias, Liebman, et al., 1984, Keesee and Castleman, 1986; M |
By formula: C5H6N+ + C4H10O = (C5H6N+ • C4H10O)
Bond type: Hydrogen bonds of the type NH+-O between organics
Quantity | Value | Units | Method | Reference | Comment |
---|---|---|---|---|---|
ΔrH° | 94.1 | kJ/mol | PHPMS | Meot-Ner (Mautner), 1983 | gas phase; M |
Quantity | Value | Units | Method | Reference | Comment |
ΔrS° | 138. | J/mol*K | PHPMS | Meot-Ner (Mautner), 1983 | gas phase; M |
By formula: C5H11O+ + C4H10O = (C5H11O+ • C4H10O)
Bond type: Hydrogen bonds of the type OH-O between organics
Quantity | Value | Units | Method | Reference | Comment |
---|---|---|---|---|---|
ΔrH° | 123. | kJ/mol | ICR | Larson and McMahon, 1982 | gas phase; switching reaction((CH3)2OH+)(CH3)2O, Entropy change calculated or estimated; Grimsrud and Kebarle, 1973, Lias, Liebman, et al., 1984, Keesee and Castleman, 1986; M |
Quantity | Value | Units | Method | Reference | Comment |
ΔrS° | 123. | J/mol*K | N/A | Larson and McMahon, 1982 | gas phase; switching reaction((CH3)2OH+)(CH3)2O, Entropy change calculated or estimated; Grimsrud and Kebarle, 1973, Lias, Liebman, et al., 1984, Keesee and Castleman, 1986; M |
Quantity | Value | Units | Method | Reference | Comment |
ΔrG° | 86.6 | kJ/mol | ICR | Larson and McMahon, 1982 | gas phase; switching reaction((CH3)2OH+)(CH3)2O, Entropy change calculated or estimated; Grimsrud and Kebarle, 1973, Lias, Liebman, et al., 1984, Keesee and Castleman, 1986; M |
By formula: C6H14N+ + C4H10O = (C6H14N+ • C4H10O)
Bond type: Hydrogen bonds of the type NH+-O between organics
Quantity | Value | Units | Method | Reference | Comment |
---|---|---|---|---|---|
ΔrH° | 92.0 | kJ/mol | PHPMS | Meot-Ner, 1984 | gas phase; M |
ΔrH° | 91.6 | kJ/mol | PHPMS | Meot-Ner (Mautner), 1983 | gas phase; M |
Quantity | Value | Units | Method | Reference | Comment |
ΔrS° | 133. | J/mol*K | PHPMS | Meot-Ner, 1984 | gas phase; M |
ΔrS° | 133. | J/mol*K | PHPMS | Meot-Ner (Mautner), 1983 | gas phase; M |
By formula: C6H15O+ + C4H10O = (C6H15O+ • C4H10O)
Bond type: Hydrogen bonds of the type OH-O between organics
Quantity | Value | Units | Method | Reference | Comment |
---|---|---|---|---|---|
ΔrH° | 123. | kJ/mol | ICR | Larson and McMahon, 1982 | gas phase; switching reaction((CH3)2OH+)(CH3)2O, Entropy change calculated or estimated; Grimsrud and Kebarle, 1973, Lias, Liebman, et al., 1984, Keesee and Castleman, 1986; M |
Quantity | Value | Units | Method | Reference | Comment |
ΔrS° | 126. | J/mol*K | N/A | Larson and McMahon, 1982 | gas phase; switching reaction((CH3)2OH+)(CH3)2O, Entropy change calculated or estimated; Grimsrud and Kebarle, 1973, Lias, Liebman, et al., 1984, Keesee and Castleman, 1986; M |
Quantity | Value | Units | Method | Reference | Comment |
ΔrG° | 85.4 | kJ/mol | ICR | Larson and McMahon, 1982 | gas phase; switching reaction((CH3)2OH+)(CH3)2O, Entropy change calculated or estimated; Grimsrud and Kebarle, 1973, Lias, Liebman, et al., 1984, Keesee and Castleman, 1986; M |
By formula: C6H15O+ + C4H10O = (C6H15O+ • C4H10O)
Bond type: Hydrogen bonds of the type OH-O between organics
Quantity | Value | Units | Method | Reference | Comment |
---|---|---|---|---|---|
ΔrH° | 109. | kJ/mol | ICR | Larson and McMahon, 1982 | gas phase; switching reaction((CH3)2OH+)(CH3)2O, Entropy change calculated or estimated; Grimsrud and Kebarle, 1973, Lias, Liebman, et al., 1984, Keesee and Castleman, 1986; M |
Quantity | Value | Units | Method | Reference | Comment |
ΔrS° | 129. | J/mol*K | N/A | Larson and McMahon, 1982 | gas phase; switching reaction((CH3)2OH+)(CH3)2O, Entropy change calculated or estimated; Grimsrud and Kebarle, 1973, Lias, Liebman, et al., 1984, Keesee and Castleman, 1986; M |
Quantity | Value | Units | Method | Reference | Comment |
ΔrG° | 70.3 | kJ/mol | ICR | Larson and McMahon, 1982 | gas phase; switching reaction((CH3)2OH+)(CH3)2O, Entropy change calculated or estimated; Grimsrud and Kebarle, 1973, Lias, Liebman, et al., 1984, Keesee and Castleman, 1986; M |
+
= C4H10ClO-
By formula: Cl- + C4H10O = C4H10ClO-
Quantity | Value | Units | Method | Reference | Comment |
---|---|---|---|---|---|
ΔrH° | 37.7 ± 1.7 | kJ/mol | TDAs | Bogdanov, Lee, et al., 2001 | gas phase; B |
Quantity | Value | Units | Method | Reference | Comment |
ΔrG° | 14. ± 4.2 | kJ/mol | TDAs | Bogdanov, Lee, et al., 2001 | gas phase; B |
By formula: K+ + C4H10O = (K+ • C4H10O)
Quantity | Value | Units | Method | Reference | Comment |
---|---|---|---|---|---|
ΔrH° | 93.3 | kJ/mol | HPMS | Davidson and Kebarle, 1976 | gas phase; M |
Quantity | Value | Units | Method | Reference | Comment |
ΔrS° | 103. | J/mol*K | HPMS | Davidson and Kebarle, 1976 | gas phase; M |
By formula: Mg+ + C4H10O = (Mg+ • C4H10O)
Quantity | Value | Units | Method | Reference | Comment |
---|---|---|---|---|---|
ΔrH° | 280. ± 20. | kJ/mol | ICR | Operti, Tews, et al., 1988 | gas phase; switching reaction,Thermochemical ladder(Mg+)CH3OH; M |
By formula: NO- + C4H10O = (NO- • C4H10O)
Quantity | Value | Units | Method | Reference | Comment |
---|---|---|---|---|---|
ΔrH° | 173. | kJ/mol | ICR | Reents and Freiser, 1981 | gas phase; switching reaction,Thermochemical ladder(NO+)C2H5OH, Entropy change calculated or estimated; Farid and McMahon, 1978; M |
By formula: Na+ + C4H10O = (Na+ • C4H10O)
Quantity | Value | Units | Method | Reference | Comment |
---|---|---|---|---|---|
ΔrH° | 130. ± 1. | kJ/mol | HPMS | Guo, Conklin, et al., 1989 | gas phase; M |
Quantity | Value | Units | Method | Reference | Comment |
ΔrS° | 118. | J/mol*K | HPMS | Guo, Conklin, et al., 1989 | gas phase; M |
Free energy of reaction
ΔrG° (kJ/mol) | T (K) | Method | Reference | Comment |
---|---|---|---|---|
89.1 | 298. | IMRE | McMahon and Ohanessian, 2000 | Anchor alanine=39.89; RCD |
By formula: (Na+ • C4H10O) + C4H10O = (Na+ • 2C4H10O)
Quantity | Value | Units | Method | Reference | Comment |
---|---|---|---|---|---|
ΔrH° | 96. ± 1. | kJ/mol | HPMS | Guo, Conklin, et al., 1989 | gas phase; M |
Quantity | Value | Units | Method | Reference | Comment |
ΔrS° | 117. | J/mol*K | HPMS | Guo, Conklin, et al., 1989 | gas phase; M |
By formula: (Na+ • 2C4H10O) + C4H10O = (Na+ • 3C4H10O)
Quantity | Value | Units | Method | Reference | Comment |
---|---|---|---|---|---|
ΔrH° | 69. ± 1. | kJ/mol | HPMS | Guo, Conklin, et al., 1989 | gas phase; M |
Quantity | Value | Units | Method | Reference | Comment |
ΔrS° | 123. | J/mol*K | HPMS | Guo, Conklin, et al., 1989 | gas phase; M |

Condensed phase thermochemistry data

Data compiled as indicated in comments:
ALS - Hussein Y. Afeefy, Joel F. Liebman, and Stephen E. Stein
DH - Eugene S. Domalski and Elizabeth D. Hearing
Quantity | Value | Units | Method | Reference | Comment |
---|---|---|---|---|---|
ΔfH°liquid | -64.81 ± 0.45 | kcal/mol | Ccb | Murrin and Goldhagen, 1957 | ALS |
Quantity | Value | Units | Method | Reference | Comment |
ΔcH°liquid | -652.99 ± 0.45 | kcal/mol | Ccb | Murrin and Goldhagen, 1957 | Corresponding ΔfHºliquid = -64.79 kcal/mol (simple calculation by NIST; no Washburn corrections); ALS |
Quantity | Value | Units | Method | Reference | Comment |
S°liquid | 60.59 | cal/mol*K | N/A | Counsell, Lee, et al., 1971 | DH |
S°liquid | 60.40 | cal/mol*K | N/A | Parks, Kelley, et al., 1929 | Extrapolation below 90 K, 58.6 J/mol*K. Revision of previous data.; DH |
S°liquid | 67.71 | cal/mol*K | N/A | Parks and Huffman, 1926 | Extrapolation below 90 K, 88.70 J/mol*K.; DH |
Constant pressure heat capacity of liquid
Cp,liquid (cal/mol*K) | Temperature (K) | Reference | Comment |
---|---|---|---|
41.23 | 298.15 | Counsell, Lee, et al., 1971 | T = 15 to 300 K.; DH |
41.080 | 293.15 | Mazur, 1939 | T = -112 to 20°C.; DH |
41.11 | 293. | Mazur, 1939, 2 | T = -110 to 20°C.; DH |
40.01 | 290. | Kurnakov and Voskresenskaya, 1936 | DH |
39.39 | 255.2 | Aoyama and Kanda, 1935 | T = 80 to 255 K. Value is unsmoothed experimental datum.; DH |
43.00 | 308. | Bennewitz and Wendroth, 1927 | T = 308 to 488 K. Value is unsmoothed experimental datum. Pressure 40 atmospheres.; DH |
40.80 | 290.0 | Parks and Huffman, 1926 | T = 76 to 290 K. Value is unsmoothed experimental datum.; DH |
42.81 | 286.6 | Keyes and Beattie, 1924 | T = 274, 286 K.; DH |

Phase change data

Data compiled as indicated in comments:
BS - Robert L. Brown and Stephen E. Stein
TRC - Thermodynamics Research Center, NIST Boulder Laboratories, Chris Muzny director
ALS - Hussein Y. Afeefy, Joel F. Liebman, and Stephen E. Stein
AC - William E. Acree, Jr., James S. Chickos
DH - Eugene S. Domalski and Elizabeth D. Hearing
Quantity | Value | Units | Method | Reference | Comment |
---|---|---|---|---|---|
Tboil | 307.7 ± 0.4 | K | AVG | N/A | Average of 20 out of 21 values; Individual data points |
Quantity | Value | Units | Method | Reference | Comment |
Tfus | 154. ± 7. | K | AVG | N/A | Average of 13 out of 14 values; Individual data points |
Quantity | Value | Units | Method | Reference | Comment |
Ttriple | 156.92 | K | N/A | Wilhoit, Chao, et al., 1985 | Uncertainty assigned by TRC = 0.05 K; TRC |
Ttriple | 149.86 | K | N/A | Counsell, Lee, et al., 1971, 2 | Crystal phase 2 phase; Uncertainty assigned by TRC = 0.02 K; TRC |
Ttriple | 156.92 | K | N/A | Counsell, Lee, et al., 1971, 2 | Crystal phase 1 phase; Uncertainty assigned by TRC = 0.02 K; TRC |
Ttriple | 156.8 | K | N/A | Parks and Huffman, 1926, 2 | Uncertainty assigned by TRC = 0.2 K; TRC |
Quantity | Value | Units | Method | Reference | Comment |
Tc | 467. ± 2. | K | AVG | N/A | Average of 29 out of 30 values; Individual data points |
Quantity | Value | Units | Method | Reference | Comment |
Pc | 36.0 ± 0.9 | atm | AVG | N/A | Average of 16 out of 17 values; Individual data points |
Quantity | Value | Units | Method | Reference | Comment |
Vc | 0.274 | l/mol | N/A | Kobe, Ravicz, et al., 1956 | Uncertainty assigned by TRC = 0.005 l/mol; TRC |
Quantity | Value | Units | Method | Reference | Comment |
ρc | 3.5 ± 0.4 | mol/l | AVG | N/A | Average of 10 values; Individual data points |
Quantity | Value | Units | Method | Reference | Comment |
ΔvapH° | 6.5 ± 0.1 | kcal/mol | AVG | N/A | Average of 6 values; Individual data points |
Enthalpy of vaporization
ΔvapH (kcal/mol) | Temperature (K) | Method | Reference | Comment |
---|---|---|---|---|
6.338 | 307.6 | N/A | Majer and Svoboda, 1985 | |
6.5798 | 285.0 | N/A | Keyes and Beattie, 1924 | P = 101.325 kPa; DH |
6.72 | 301. | A | Stephenson and Malanowski, 1987 | Based on data from 286. to 329. K.; AC |
6.43 | 322. | A | Stephenson and Malanowski, 1987 | Based on data from 307. to 457. K.; AC |
6.57 | 320. | A | Stephenson and Malanowski, 1987 | Based on data from 305. to 360. K.; AC |
6.38 | 432. | A | Stephenson and Malanowski, 1987 | Based on data from 417. to 467. K.; AC |
7.05 | 265. | A | Stephenson and Malanowski, 1987 | Based on data from 250. to 329. K. See also Ambrose, Sprake, et al., 1972 and Ambrose, Ellender, et al., 1976.; AC |
6.512 ± 0.001 | 295.63 | V | Counsell, Lee, et al., 1971, 3 | ALS |
6.79 | 278. | N/A | Taylor and Smith, 1922 | Based on data from 213. to 293. K.; AC |
Enthalpy of vaporization
ΔvapH =
A exp(-βTr) (1 − Tr)β
ΔvapH =
Enthalpy of vaporization (at saturation pressure)
(kcal/mol)
Tr = reduced temperature (T / Tc)
View plot Requires a JavaScript / HTML 5 canvas capable browser.
Temperature (K) | A (kcal/mol) | β | Tc (K) | Reference | Comment |
---|---|---|---|---|---|
281. to 313. | 10.28 | 0.2786 | 466.7 | Majer and Svoboda, 1985 |
Entropy of vaporization
ΔvapS (cal/mol*K) | Temperature (K) | Reference | Comment |
---|---|---|---|
23.09 | 285.0 | Keyes and Beattie, 1924 | P; DH |
Antoine Equation Parameters
log10(P) = A − (B / (T + C))
P = vapor pressure (atm)
T = temperature (K)
View plot Requires a JavaScript / HTML 5 canvas capable browser.
Temperature (K) | A | B | C | Reference | Comment |
---|---|---|---|---|---|
250.04 to 328.57 | 4.0163 | 1062.64 | -44.93 | Ambrose, Sprake, et al., 1972 | Coefficents calculated by NIST from author's data. |
350.14 to 466.73 | 4.46417 | 1354.913 | -5.537 | Ambrose, Sprake, et al., 1972 | Coefficents calculated by NIST from author's data. |
212.4 to 293.02 | 4.12806 | 1102.878 | -40.46 | Taylor and Smith, 1922 | Coefficents calculated by NIST from author's data. |
Enthalpy of fusion
ΔfusH (kcal/mol) | Temperature (K) | Reference | Comment |
---|---|---|---|
1.72 | 156.9 | Counsell, Lee, et al., 1971, 3 | AC |
1.745 | 156.8 | Parks and Huffman, 1926 | DH |
Entropy of fusion
ΔfusS (cal/mol*K) | Temperature (K) | Reference | Comment |
---|---|---|---|
11.1 | 156.8 | Parks and Huffman, 1926 | DH |
Enthalpy of phase transition
ΔHtrs (kcal/mol) | Temperature (K) | Initial Phase | Final Phase | Reference | Comment |
---|---|---|---|---|---|
1.630 | 149.86 | crystaline, II | liquid | Counsell, Lee, et al., 1971 | DH |
1.718 | 156.92 | crystaline, I | liquid | Counsell, Lee, et al., 1971 | Metastable crystal.; DH |
Entropy of phase transition
ΔStrs (cal/mol*K) | Temperature (K) | Initial Phase | Final Phase | Reference | Comment |
---|---|---|---|---|---|
10.9 | 149.86 | crystaline, II | liquid | Counsell, Lee, et al., 1971 | DH |
10.95 | 156.92 | crystaline, I | liquid | Counsell, Lee, et al., 1971 | Metastable; DH |

References

Pihlaja and Heikkil, 1968
Pihlaja, K.; Heikkil, J.,
Heats of combustion. Diethyl ether and 1,1-diethoxyethane,
Acta Chem. Scand., 1968, 22, 2731-2732. [all data]
Pedley, Naylor, et al., 1986
Pedley, J.B.; Naylor, R.D.; Kirby, S.P.,
Thermochemical Data of Organic Compounds, Chapman and Hall, New York, 1986, 1-792. [all data]
Pilcher, Skinner, et al., 1963
Pilcher, G.; Skinner, H.A.; Pell, A.S.; Pope, A.E.,
Measurements of heats of combustion by flame calorimetry. Part 1.-Diethyl ether, ethyl vinyl ether and divinyl ether,
Trans. Faraday Soc., 1963, 59, 316-330. [all data]
Murrin and Goldhagen, 1957
Murrin, J.W.; Goldhagen, S.,
Determination of the C-O bond energy from the heats of combustion of four aliphatic ethers,
NAVORD Report No. 5491, U.S. Naval Powder Factory Res. & Dev. Dept., 1957, 1-14. [all data]
Counsell J.F., 1971
Counsell J.F.,
Thermodynamic properties of organic oxygen compounds. Part XXVI. Diethyl ether,
J. Chem. Soc. A, 1971, 313-316. [all data]
Cope C.S., 1959
Cope C.S.,
Equilibria in the hydration of ethylene at elevated pressures and temperatures,
A. I. Ch. E. Journal, 1959, 5, 10-16. [all data]
Stull D.R., 1969
Stull D.R., Jr.,
The Chemical Thermodynamics of Organic Compounds. Wiley, New York, 1969. [all data]
Chao J., 1986
Chao J.,
Thermodynamic properties of key organic oxygen compounds in the carbon range C1 to C4. Part 2. Ideal gas properties,
J. Phys. Chem. Ref. Data, 1986, 15, 1369-1436. [all data]
Jennings W.H., 1934
Jennings W.H.,
Specific heat of furan and ethyl ether vapors,
J. Phys. Chem., 1934, 38, 747-751. [all data]
Jatkar S.K.K., 1939
Jatkar S.K.K.,
Supersonic velocity in gases and vapors. V. Heat capacity of vapors of acetone, benzene, cyclohexane, hexane and methyl, ethyl and propyl ethers,
J. Indian Inst. Sci., 1939, A22, 19-37. [all data]
Valentin F.H.H., 1950
Valentin F.H.H.,
Equilibrium and thermodynamic relation in the vapor-phase catalytic dehydration of ethyl alcohol to ethyl ether,
J. Chem. Soc., 1950, 498-500. [all data]
Szulejko and McMahon, 1991
Szulejko, J.E.; McMahon, T.B.,
A Pulsed Electron Beam, Variable Temperature, High Pressure Mass Spectrometric Reevaluation of the Proton Affinity Difference Between 2-Methylpropene and Ammonia,
Int. J. Mass Spectrom. Ion Proc., 1991, 109, 279, https://doi.org/10.1016/0168-1176(91)85109-Y
. [all data]
Larson and McMahon, 1982
Larson, J.W.; McMahon, T.B.,
Formation, Thermochemistry, and Relative Stabilities of Proton - Bound dimers of Oxygen n - Donor Bases from Ion Cyclotron Resonance Solvent - Exchange Equilibria Measurements,
J. Am. Chem. Soc., 1982, 104, 23, 6255, https://doi.org/10.1021/ja00387a016
. [all data]
Grimsrud and Kebarle, 1973
Grimsrud, E.P.; Kebarle, P.,
Gas Phase Ion Equilibria Studies of the Solvation of the Hydrogen Ion by Methanol, Dimethyl Ether and Water. Effect of Hydrogen Bonding,
J. Am. Chem. Soc., 1973, 95, 24, 7939, https://doi.org/10.1021/ja00805a002
. [all data]
Lias, Liebman, et al., 1984
Lias, S.G.; Liebman, J.F.; Levin, R.D.,
Evaluated gas phase basicities and proton affinities of molecules heats of formation of protonated molecules,
J. Phys. Chem. Ref. Data, 1984, 13, 695. [all data]
Keesee and Castleman, 1986
Keesee, R.G.; Castleman, A.W., Jr.,
Thermochemical data on Ggs-phase ion-molecule association and clustering reactions,
J. Phys. Chem. Ref. Data, 1986, 15, 1011. [all data]
Wojtyniak and Stone, 1986
Wojtyniak, A.C.M.; Stone, A.J.,
A High-Pressure Mass Spectrometric Study of the Bonding of Trimethylsilylium to Oxygen and Aromatic Bases,
Can. J. Chem., 1986, 74, 59. [all data]
Meot-Ner, 1984
Meot-Ner, (Mautner)M.,
The Ionic Hydrogen Bond and Ion Solvation. 1. -NH+ O-, -NH+ N- and -OH+ O- Bonds. Correlations with Proton Affinity. Deviations Due to Structural Effects,
J. Am. Chem. Soc., 1984, 106, 5, 1257, https://doi.org/10.1021/ja00317a015
. [all data]
Meot-Ner (Mautner), 1983
Meot-Ner (Mautner), M.,
The Ionic Hydrogen Bond. 3. Multiple and -CH+...O- Bonds. Complexes of Ammonium Ions with Polyethers and Crown Ethers,
J. Am. Chem. Soc., 1983, 105, 15, 4912, https://doi.org/10.1021/ja00353a012
. [all data]
Allinger, Glaser, et al., 1981
Allinger, N.L.; Glaser, J.A.; Davis, H.E.,
Heats of hydrogenation of some vinyl ethers and related compounds,
J. Org. Chem., 1981, 46, 658-661. [all data]
Dolliver, Gresham, et al., 1938
Dolliver, M.A.; Gresham, T.L.; Kistiakowsky, G.B.; Smith, E.A.; Vaughan, W.E.,
Heats of organic reactions. VI. Heats of hydrogenation of some oxygen-containing compounds,
J. Am. Chem. Soc., 1938, 60, 440-450. [all data]
Cox and Pilcher, 1970
Cox, J.D.; Pilcher, G.,
Thermochemistry of Organic and Organometallic Compounds, Academic Press, New York, 1970, 1-636. [all data]
Guo, Conklin, et al., 1989
Guo, B.C.; Conklin, B.J.; Castleman, A.W.,
Thermochemical Properties of Ion Complexes Na+(M)n in the Gas Phase,
J. Am. Chem. Soc., 1989, 111, 17, 6506, https://doi.org/10.1021/ja00199a005
. [all data]
McMahon and Ohanessian, 2000
McMahon, T.B.; Ohanessian, G.,
An Experimental and Ab Initio Study of the Nature of the Binding in Gas-Phase Complexes of Sodium Ions,
Chem. Eur. J., 2000, 6, 16, 2931, https://doi.org/10.1002/1521-3765(20000818)6:16<2931::AID-CHEM2931>3.0.CO;2-7
. [all data]
Reents and Freiser, 1981
Reents, W.D.; Freiser, B.S.,
Gas-Phase Binding Energies and Spectroscopic Properties of NO+ Charge-Transfer Complexes,
J. Am. Chem. Soc., 1981, 103, 2791. [all data]
Farid and McMahon, 1978
Farid, R.; McMahon, T.B.,
Gas-Phase Ion-Molecule Reactions of Alkyl Nitrites by Ion Cyclotron Resonance Spectroscopy,
Int. J. Mass Spectrom. Ion Phys., 1978, 27, 2, 163, https://doi.org/10.1016/0020-7381(78)80037-0
. [all data]
Bogdanov, Lee, et al., 2001
Bogdanov, B.; Lee, H.J.S.; McMahon, T.B.,
Influence of fluorine substitution on the structures and thermochemistry of chloride ion-ether complexes in the gas phase,
Int. J. Mass Spectrom., 2001, 210, 387-402, https://doi.org/10.1016/S1387-3806(01)00404-3
. [all data]
Davidson and Kebarle, 1976
Davidson, W.R.; Kebarle, P.,
Binding Energies and Stabilities of Potassium Ion Complexes from Studies of Gas Phase Ion Equilibria K+ + M = K+.M,
J. Am. Chem. Soc., 1976, 98, 20, 6133, https://doi.org/10.1021/ja00436a011
. [all data]
Operti, Tews, et al., 1988
Operti, L.; Tews, E.C.; Freiser, B.S.,
Determination of Gas-Phase Ligand Binding Energies to Mg+ by FTMS Techniques,
J. Am. Chem. Soc., 1988, 110, 12, 3847, https://doi.org/10.1021/ja00220a020
. [all data]
Connett, 1972
Connett, J.E.,
Chemical equilibria 4. Enthalpy of dehydration of ethanol to diethyl ether by measurement of equilibrium constants in ethanol + ether+ water by a vapour flow technique,
J. Chem. Thermodyn., 1972, 4, 135-138. [all data]
Gurevich and Roshchina, 2003
Gurevich, K.B.; Roshchina, T.M.,
G as chromatography study of silica modified with polyfluoroalkyl groups,
J. Chromatogr. A, 2003, 1008, 97-103. [all data]
Winskowski, 1983
Winskowski, J.,
Gaschromatographische Identifizierung von Stoffen anhand von Indexziffem und unterschiedlichen Detektoren,
Chromatographia, 1983, 17, 3, 160-165, https://doi.org/10.1007/BF02271041
. [all data]
Becerra, Sánchez, et al., 1982
Becerra, M.R.; Sánchez, E.F.; Domínguez, J.A.G.; Muñoz, J.G.; Molera, M.J.,
The use of gaseous and liquid n-paraffins in GC identification of oxidation products of acetondimethyl acetal,
J. Chromatogr. Sci., 1982, 20, 8, 363-366, https://doi.org/10.1093/chromsci/20.8.363
. [all data]
Goebel, 1982
Goebel, K.-J.,
Gaschromatographische Identifizierung Niedrig Siedender Substanzen Mittels Retentionsindices und Rechnerhilfe,
J. Chromatogr., 1982, 235, 1, 119-127, https://doi.org/10.1016/S0021-9673(00)95793-5
. [all data]
Bogoslovsky, Anvaer, et al., 1978
Bogoslovsky, Yu.N.; Anvaer, B.I.; Vigdergauz, M.S.,
Chromatographic constants in gas chromatography (in Russian), Standards Publ. House, Moscow, 1978, 192. [all data]
Riedo, Fritz, et al., 1976
Riedo, F.; Fritz, D.; Tarján, G.; Kováts, E.Sz.,
A tailor-made C87 hydrocarbon as a possible non-polar standard stationary phase for gas chromatography,
J. Chromatogr., 1976, 126, 63-83, https://doi.org/10.1016/S0021-9673(01)84063-2
. [all data]
Golovnya and Garbuzov, 1974
Golovnya, R.V.; Garbuzov, V.G.,
Effect of heteroatom in aliphatic sulfur- and oxygen-containing compounds on the values of the retention indices in gas chromatography,
Izv. Akad. Nauk SSSR Ser. Khim., 1974, 7, 1519-1521. [all data]
Vernon, 1971
Vernon, F.,
An investigation into hydrogen bonding in gas-liquid chromatography,
J. Chromatogr., 1971, 63, 249-257, https://doi.org/10.1016/S0021-9673(01)85637-5
. [all data]
Jonas, Janák, et al., 1966
Jonas, J.; Janák, J.; Kratochvíl, M.,
Structural investigations with the aid of Kovats retention index system on one (nonpolar) stationary phase,
J. Gas Chromatogr., 1966, 4, 9, 332-335, https://doi.org/10.1093/chromsci/4.9.332
. [all data]
Wehrli and Kováts, 1959
Wehrli, A.; Kováts, E.,
Gas-chromatographische Charakterisierung ogranischer Verbindungen. Teil 3: Berechnung der Retentionsindices aliphatischer, alicyclischer und aromatischer Verbindungen,
Helv. Chim. Acta, 1959, 7, 7, 2709-2736, https://doi.org/10.1002/hlca.19590420745
. [all data]
Anderson, Jurel, et al., 1973
Anderson, A.; Jurel, S.; Shymanska, M.; Golender, L.,
Gas-liquid chromatography of some aliphatic and heterocyclic mono- and pollyfunctional amines. VII. Retention indices of amines in some polar and unpolar stationary phases,
Latv. PSR Zinat. Akad. Vestis Kim. Ser., 1973, 1, 51-63. [all data]
Shimadzu, 2003
Shimadzu,
Gas chromatography analysis of organic solvents using capillary columns (No. 2), 2003, retrieved from http://www.shimadzu.com/apps/form.cfm. [all data]
Chen, Kuo, et al., 1982
Chen, C.-C.; Kuo, M.-C.; Hwang, L.S.; Wu, J.S.-B.; Wu, C.-M.,
Headspace components of passion fruit juice,
J. Agric. Food Chem., 1982, 30, 6, 1211-1215, https://doi.org/10.1021/jf00114a052
. [all data]
Shimadzu, 2003, 2
Shimadzu,
Gas chromatography analysis of organic solvents using capillary columns (No. 3), 2003, retrieved from http://www.shimadzu.com/apps/form.cfm. [all data]
Dufka, Malinsky, et al., 1971
Dufka, O.; Malinsky, J.; Vladyka, J.,
Sorpcni materialy pro plynovou chromatographii - III,
Chemicky promysl., 1971, 21/46, 9, 459-463. [all data]
Kotowska, Zalikowski, et al., 2012
Kotowska, U.; Zalikowski, M.; Isidorov, V.A.,
HS-SPME/GC-MS analysis of volatile and semi-volatile organic compounds emitted from municipal sewage sludge,
Environ. Monit. Asses., 2012, 184, 5, 2893-2907, https://doi.org/10.1007/s10661-011-2158-8
. [all data]
Zenkevich, Eliseenkov, et al., 2011
Zenkevich, I.G.; Eliseenkov, E.V.; Kasatochkin, A.N.; Ukolov, A.I.,
Identification of the products of nonregioselective organic reactions by chromatography - mass spectrometry: chloro derivatives of dialkyl ethers,
Rus. J. Anal. Chem., 2011, 66, 14, 1445-1454, https://doi.org/10.1134/S1061934811140218
. [all data]
Savel'eva, Zenkevich, et al., 2003
Savel'eva, E.I.; Zenkevich, I.G.; Radilov, A.S.,
Identification the Products of Chemical Neutralization of O-Isobutyl-S-(2-diethylaminoethyl)methylthiophosphonate in the Composition of Bitumen-Salt Matrices,
Zh. Anal. Khim. (Rus.), 2003, 58, 2, 135-145. [all data]
Habu, Flath, et al., 1985
Habu, T.; Flath, R.A.; Mon, T.R.; Morton, J.F.,
Volatile components of Rooibos tea (Aspalathus linearis),
J. Agric. Food Chem., 1985, 33, 2, 249-254, https://doi.org/10.1021/jf00062a024
. [all data]
Rotsatschakul, Visesanguan, et al., 2009
Rotsatschakul, P.; Visesanguan, W.; Smitinont, T.; Chaiseri, S.,
Changes in volatile compounds during fermentation of nham (Thai fermented sausage),
Int. Food Res. J., 2009, 16, 391-414. [all data]
Garcia-Estaban, Ansorena, et al., 2004
Garcia-Estaban, M.; Ansorena, D.; Astiasaran, I.; Martin, D.; Ruiz, J.,
Comparison of simultaneous distillation extraction (SDE) and solid-phase microextraction (SPME) for the analysis of volatile compounds in dry-cured ham,
J. Sci. Food Agric., 2004, 84, 11, 1364-1370, https://doi.org/10.1002/jsfa.1826
. [all data]
Garcia-Estaban, Ansorena, et al., 2004, 2
Garcia-Estaban, M.; Ansorena, D.; Astiasarán, I.; Ruiz, J.,
Study of the effect of different fiber coatings and extraction conditions on dry cured ham volatile compounds extracted by solid-phase microextraction (SPME),
Talanta, 2004, 64, 2, 458-466, https://doi.org/10.1016/j.talanta.2004.03.007
. [all data]
Flanagan, Streete, et al., 1997
Flanagan, R.J.; Streete, P.J.; Ramsey, J.D.,
Volatile Substance Abuse, UNODC Technical Series, No 5, United Nations, Office on Drugs and Crime, Vienna International Centre, PO Box 500, A-1400 Vienna, Austria, 1997, 56, retrieved from http://www.odccp.org/pdf/technicalseries1997-01-011.pdf. [all data]
Zenkevich, 1997
Zenkevich, I.G.,
Influence of the Variations of Dynamics Molecular Parameterts on the Additivity of Chromatigraphic Retention Indices of Products of Organic Reactions Relative to Initial Reagents,
Dokl. Akad. Nauk (Rus.), 1997, 353, 5, 625-627. [all data]
Zenkevich, Chupalov, et al., 1996
Zenkevich, I.G.; Chupalov, A.A.; Herzschuh, R.,
Correlation of the Increments of Gas Chromatographic Retention Indices with the Differences of Innermolecular Energies of Reagents and Products of Chemical Reactions,
Zh. Org. Khim. (Rus.), 1996, 32, 11, 1685-1691. [all data]
Strete, Ruprah, et al., 1992
Strete, P.J.; Ruprah, M.; Ramsey, J.D.; Flanagan, R.J.,
Detection and identification of volatile substances by headspace capillary gas chromatography to aid the diagnosis of acute poisoning,
Analyst, 1992, 117, 7, 1111-1127, https://doi.org/10.1039/an9921701111
. [all data]
Kawai, Ishida, et al., 1991
Kawai, T.; Ishida, Y.; Kakiuchi, H.; Ikeda, N.; Higashida, T.; Nakamura, S.,
Flavor components of dried squid,
J. Agric. Food Chem., 1991, 39, 4, 770-777, https://doi.org/10.1021/jf00004a031
. [all data]
Sun, Siepmann, et al., 2006
Sun, L.; Siepmann, J.I.; Klotz, W.L.; Schure, M.R.,
retention in gas-liquid chromatography with a polyethylene oxide stationary phase: molecular simulation and experiment,
J. Chromatogr. A, 2006, 1126, 1-2, 373-380, https://doi.org/10.1016/j.chroma.2006.05.084
. [all data]
Labropoulos, Palmer, et al., 1982
Labropoulos, A.E.; Palmer, J.K.; Tao, P.,
Flavor evaluation and characterization of yogurt as affected by ultra-high temperature and vat processes,
J. Dairy Sci., 1982, 65, 2, 191-196, https://doi.org/10.3168/jds.S0022-0302(82)82176-0
. [all data]
Vinogradov, 2004
Vinogradov, B.A.,
Production, composition, properties and application of essential oils, 2004, retrieved from http://viness.narod.ru. [all data]
Peng, Yang, et al., 1991
Peng, C.T.; Yang, Z.C.; Ding, S.F.,
Prediction of rentention idexes. II. Structure-retention index relationship on polar columns,
J. Chromatogr., 1991, 586, 1, 85-112, https://doi.org/10.1016/0021-9673(91)80028-F
. [all data]