Benzene, 1,3,5-trimethyl-2,4,6-trinitro-
- Formula: C9H9N3O6
- Molecular weight: 255.1843
- IUPAC Standard InChIKey: YVJCXMCIFPUNDO-UHFFFAOYSA-N
- CAS Registry Number: 602-96-0
- Chemical structure:
View 3d structure (requires JavaScript / HTML 5) - Permanent link for this species. Use this link for bookmarking this species for future reference.

Condensed phase thermochemistry data

Data compiled by: Hussein Y. Afeefy, Joel F. Liebman, and Stephen E. Stein
Quantity | Value | Units | Method | Reference | Comment |
---|---|---|---|---|---|
ΔfH°solid | -124.5 | kJ/mol | Ccb | Medard and Thomas, 1949 | Author's hf298_condensed=-34.1 kcal/mol |
Quantity | Value | Units | Method | Reference | Comment |
ΔcH°solid | -4703.36 | kJ/mol | Ccb | Medard and Thomas, 1949 | Author's hf298_condensed=-34.1 kcal/mol |

Phase change data

Data compiled by: William E. Acree, Jr., James S. Chickos
Enthalpy of sublimation
ΔsubH (kJ/mol) | Temperature (K) | Method | Reference | Comment |
---|---|---|---|---|
103.6 ± 1.2 | 319. to 397. | ME | Stephenson and Malanowski, 1987 | See also Cundall, Frank Palmer, et al., 1978. |

References

Medard and Thomas, 1949
Medard, L.; Thomas, M.,
Determinations calorimetriques concernant dix-huit derives nitres ou nitrates organiques.,
Mem. Poudres, 1949, 29, 173-195. [all data]
Stephenson and Malanowski, 1987
Stephenson, Richard M.; Malanowski, Stanislaw,
Handbook of the Thermodynamics of Organic Compounds, 1987, https://doi.org/10.1007/978-94-009-3173-2
. [all data]
Cundall, Frank Palmer, et al., 1978
Cundall, Robert B.; Frank Palmer, T.; Wood, Colin E.C.,
Vapour pressure measurements on some organic high explosives,
J. Chem. Soc., Faraday Trans. 1, 1978, 74, 0, 1339, https://doi.org/10.1039/f19787401339
. [all data]