cyclohexanethiol, 4-methyl-
- Formula: C7H14S
- Molecular weight: 130.251
- IUPAC Standard InChIKey: JYGRMXYSBUHFOS-UHFFFAOYSA-N
- CAS Registry Number: 60260-87-9
- Chemical structure:
View 3d structure (requires JavaScript / HTML 5) - Stereoisomers:

Phase change data

Data compiled by: Thermodynamics Research Center, NIST Boulder Laboratories, Chris Muzny director
Quantity | Value | Units | Method | Reference | Comment |
---|---|---|---|---|---|
Tboil | 442. | K | N/A | Sabatier and Mailhe, 1910 | Uncertainty assigned by TRC = 3. K |

References

Sabatier and Mailhe, 1910
Sabatier, P.; Mailhe, A.,
General Methods for Direct Preparation of Thiols by Catalysic Splitting of Alcohols,
C. R. Hebd. Seances Acad. Sci., 1910, 150, 1217. [all data]