Naphthalene, 1,8-dinitro-
- Formula: C10H6N2O4
- Molecular weight: 218.1656
- IUPAC Standard InChIKey: AVCSMMMOCOTIHF-UHFFFAOYSA-N
- CAS Registry Number: 602-38-0
- Chemical structure:

Condensed phase thermochemistry data

Data compiled as indicated in comments:
ALS - Hussein Y. Afeefy, Joel F. Liebman, and Stephen E. Stein
DH - Eugene S. Domalski and Elizabeth D. Hearing
Quantity | Value | Units | Method | Reference | Comment |
---|---|---|---|---|---|
ΔfH°solid | 46.2 ± 5.0 | kJ/mol | Ccb | Medard and Thomas, 1955 | Reanalyzed by Cox and Pilcher, 1970, Original value = 51.0 kJ/mol; ALS |
ΔfH°solid | 26.7 | kJ/mol | Ccb | Rinkenbach, 1930 | Author hf298_condensed[kcal/mol]=2.649; ALS |
Quantity | Value | Units | Method | Reference | Comment |
ΔcH°solid | -4838.8 ± 5.0 | kJ/mol | Ccb | Medard and Thomas, 1955 | Reanalyzed by Cox and Pilcher, 1970, Original value = -4843.8 kJ/mol; ALS |
ΔcH°solid | -4825.8 ± 5.0 | kJ/mol | Ccb | Badoche, 1937 | Reanalyzed by Cox and Pilcher, 1970, Original value = -4826.98 kJ/mol; ALS |
ΔcH°solid | -4819.34 | kJ/mol | Ccb | Rinkenbach, 1930 | Author hf298_condensed[kcal/mol]=2.649; ALS |
Constant pressure heat capacity of solid
Cp,solid (J/mol*K) | Temperature (K) | Reference | Comment |
---|---|---|---|
254.4 | 323. | Satoh and Sogabe, 1941 | T = 0 to 100°C. Mean value.; DH |

Phase change data

Data compiled by: William E. Acree, Jr., James S. Chickos
Enthalpy of vaporization
ΔvapH (kJ/mol) | Temperature (K) | Method | Reference | Comment |
---|---|---|---|---|
78.5 | 568. | A | Stephenson and Malanowski, 1987 | Based on data from 553. to 715. K. |

Lee's RI, non-polar column, temperature ramp

Data compiled by: NIST Mass Spectrometry Data Center, William E. Wallace, director

Column type CapillaryCapillary
Active phase HP-5SE-52
Column length (m) 30.30.
Carrier gas HeliumHe
Substrate
Column diameter (mm) 0.250.3
Phase thickness (μm) 0.250.25
Tstart (C) 50.25.
Tend (C) 310.295.
Heat rate (K/min) 6.4.
Initial hold (min) 1.5
Final hold (min) 10.
I 360.85360.20
ReferencePedersen, Durant, et al., 2005White, Robbat, et al., 1983
Comment MSDC-RI MSDC-RI

References

Medard and Thomas, 1955
Medard, L.; Thomas, M.,
Chaleurs de combustion de treize substances explosives ou apparentees a des explosifs,
Mem. Poudres, 1955, 38, 46-63. [all data]
Cox and Pilcher, 1970
Cox, J.D.; Pilcher, G.,
Thermochemistry of Organic and Organometallic Compounds, Academic Press, New York, 1970, 1-636. [all data]
Rinkenbach, 1930
Rinkenbach, W.H.,
The heats of combustion and formation of aromatic nitro compounds,
J. Am. Chem. Soc., 1930, 52, 115-120. [all data]
Badoche, 1937
Badoche, M.,
Determinations de la chaleur de combustion de quelques derives nitres du naphtalene,
Bull. Soc. Chim. France, 1937, 4, 549-557. [all data]
Satoh and Sogabe, 1941
Satoh, S.; Sogabe, T.,
The heat capacities of some organic compounds containing nitrogen and the atomic heat of nitrogen. (4), Sci.,
Pap. Inst. Phys. Chem. Res. (Tokyo), 1941, 38, 246-251. [all data]
Stephenson and Malanowski, 1987
Stephenson, Richard M.; Malanowski, Stanislaw,
Handbook of the Thermodynamics of Organic Compounds, 1987, https://doi.org/10.1007/978-94-009-3173-2
. [all data]
Kojima M., 1967
Kojima M.,
UV atlas of organic compounds, 1967, 3, E1/34. [all data]