Toluene, 2,3,4-trinitro-
- Formula: C7H5N3O6
- Molecular weight: 227.1311
- IUPAC Standard InChIKey: FPKOPBFLPLFWAD-UHFFFAOYSA-N
- CAS Registry Number: 602-29-9
- Chemical structure:
View 3d structure (requires JavaScript / HTML 5) - Permanent link for this species. Use this link for bookmarking this species for future reference.

Condensed phase thermochemistry data

Data compiled by: Hussein Y. Afeefy, Joel F. Liebman, and Stephen E. Stein
Quantity | Value | Units | Method | Reference | Comment |
---|---|---|---|---|---|
ΔcH°solid | -3410. | kJ/mol | Ccb | Handrick, 1956 | |
ΔcH°solid | -3414. | kJ/mol | Ccb | Handrick, 1956 | hcomb by K.Tomioka and Takahashi |
ΔcH°solid | -3485. | kJ/mol | Ccb | Garner and Abernethy, 1921 |

References

Handrick, 1956
Handrick, G.R.,
Report of the study of pure explosive compounds. Part IV. Calculation of heat of combustion of organic compounds from structural features and calculation of power of high explosives, Rpt. C-58247 for the Office of the Chief of Ordnance, contract DA-19-020-ORD-47 by the Arthur D. Little, Inc., Cambridge, MA, 1956, 467-573. [all data]
Garner and Abernethy, 1921
Garner, W.E.; Abernethy, C.L.,
Heats of combustion and formation of nitro-compounds. Part I. - Benzene, toluene, phenol and methylaniline series,
Proc. Roy. Soc. London A, 1921, 213-235. [all data]