Benzene, 1-methyl-2,3-dinitro-
- Formula: C7H6N2O4
- Molecular weight: 182.1335
- IUPAC Standard InChIKey: DYSXLQBUUOPLBB-UHFFFAOYSA-N
- CAS Registry Number: 602-01-7
- Chemical structure:
View 3d structure (requires JavaScript / HTML 5) - Other names: Toluene, 2,3-dinitro-; 2,3-Dinitrotoluene; 2,3-DNT; 1-Methyl-2,3-dinitro-benzene

Condensed phase thermochemistry data

Data compiled by: Hussein Y. Afeefy, Joel F. Liebman, and Stephen E. Stein
Quantity | Value | Units | Method | Reference | Comment |
---|---|---|---|---|---|
ΔcH°solid | -4015. | kJ/mol | Ccb | Garner and Abernethy, 1921 |

Phase change data

Data compiled as indicated in comments:
TRC - Thermodynamics Research Center, NIST Boulder Laboratories, Chris Muzny director
AC - William E. Acree, Jr., James S. Chickos
Quantity | Value | Units | Method | Reference | Comment |
---|---|---|---|---|---|
Tfus | 330. | K | N/A | Hwang, Tamura, et al., 1990 | Uncertainty assigned by TRC = 0.1 K; TRC |
Enthalpy of sublimation
ΔsubH (kJ/mol) | Temperature (K) | Method | Reference | Comment |
---|---|---|---|---|
97.0 ± 2.1 | 270. to 315. | ME | Freedman, Kebabian, et al., 2008 | AC |
Enthalpy of fusion
ΔfusH (kJ/mol) | Temperature (K) | Reference | Comment |
---|---|---|---|
17.57 | 329.8 | Acree, 1993 | AC |

Gas phase ion energetics data

Data compiled by: John E. Bartmess
Electron affinity determinations
EA (eV) | Method | Reference | Comment |
---|---|---|---|
<1.770 ± 0.050 | PD | Mock and Grimsrud, 1989 |

References

Garner and Abernethy, 1921
Garner, W.E.; Abernethy, C.L.,
Heats of combustion and formation of nitro-compounds. Part I. - Benzene, toluene, phenol and methylaniline series,
Proc. Roy. Soc. London A, 1921, 213-235. [all data]
Hwang, Tamura, et al., 1990
Hwang, D.-R.; Tamura, M.; Yoshida, T.; Tanaka, N.; Hosoya, F.,
Estimation of ΔH°f of nitro derivatives of benzene and toluene using AM1 and DSC,
J. Energ. Mater., 1990, 8, 85-98. [all data]
Freedman, Kebabian, et al., 2008
Freedman, Andrew; Kebabian, Paul L.; Li, Ziman; Robinson, Wade A.; Wormhoudt, Joda C.,
Apparatus for determination of vapor pressures at ambient temperatures employing a Knudsen effusion cell and quartz crystal microbalance,
Meas. Sci. Technol., 2008, 19, 12, 125102, https://doi.org/10.1088/0957-0233/19/12/125102
. [all data]
Acree, 1993
Acree, William E.,
Thermodynamic properties of organic compounds,
Thermochimica Acta, 1993, 219, 97-104, https://doi.org/10.1016/0040-6031(93)80486-T
. [all data]
Mock and Grimsrud, 1989
Mock, R.S.; Grimsrud, E.P.,
Gas-Phase Electron Photodetachment Spectroscopy of the Molecular Anions of Nitroaromatic Hydrocarbons at Atmospheric Pressure,
J. Am. Chem. Soc., 1989, 111, 8, 2861, https://doi.org/10.1021/ja00190a020
. [all data]