Benzene, 1,3-dichloro-2-nitro-
- Formula: C6H3Cl2NO2
- Molecular weight: 192.000
- IUPAC Standard InChIKey: VITSNECNFNNVQB-UHFFFAOYSA-N
- CAS Registry Number: 601-88-7
- Chemical structure:
View 3d structure (requires JavaScript / HTML 5) - Other names: 1,3-dichloro-2-nitrobenzene

Phase change data

Data compiled by: Thermodynamics Research Center, NIST Boulder Laboratories, Chris Muzny director
Quantity | Value | Units | Method | Reference | Comment |
---|---|---|---|---|---|
Tfus | 343. | K | N/A | Buechner, 1906 | Uncertainty assigned by TRC = 2. K |

References

Buechner, 1906
Buechner, E.H.,
Z. Phys. Chem., Stoechiom. Verwandtschaftsl., 1906, 54, 665. [all data]