cyclohexane, 1,1,2,4,4,5-hexachloro-
- Formula: C6H6Cl6
- Molecular weight: 290.830
- IUPAC Standard InChIKey: RYVQGNFBBFVLIW-UHFFFAOYSA-N
- CAS Registry Number: 60184-62-5
- Chemical structure:
View 3d structure (requires JavaScript / HTML 5) - Permanent link for this species. Use this link for bookmarking this species for future reference.

Phase change data

Data compiled by: Thermodynamics Research Center, NIST Boulder Laboratories, Chris Muzny director
Quantity | Value | Units | Method | Reference | Comment |
---|---|---|---|---|---|
Tfus | 418.15 | K | N/A | Ellefsen, Hassel, et al., 1950 | Uncertainty assigned by TRC = 1. K |

References

Ellefsen, Hassel, et al., 1950
Ellefsen, O.; Hassel, O.; Lund, E.W.,
Hexachalorocyclohexane, m. p. 145,
Acta Chem. Scand., 1950, 4, 1145. [all data]