Tyrosine
- Formula: C9H11NO3
- Molecular weight: 181.1885
- IUPAC Standard InChIKey: OUYCCCASQSFEME-MRVPVSSYSA-N
- CAS Registry Number: 60-18-4
- Chemical structure:
View 3d structure (requires JavaScript / HTML 5) - Stereoisomers:
- Other names: L-Tyrosine; Tyrosine, L-; α-Amino-β-(4-hydroxyphenyl)propionic acid; (-)-α-Amino-p-hydroxyhydrocinnamic acid; p-Tyrosine; Benzenepropanoic acid, α-amino-4-hydroxy-, (S)-; L-p-Tyrosine; L-Phenylalanine, 4-hydroxy-; Propanoic acid, 2-amino-3-(4-hydroxyphenyl)-, (S)-; L-2-Amino-3-p-hydroxyphenylpropanoic acid; (S)-α-Amino-4-hydroxybenzenepropanoic acid; (S)-Tyrosine; NSC 82624

Condensed phase thermochemistry data

Data compiled as indicated in comments:
ALS - Hussein Y. Afeefy, Joel F. Liebman, and Stephen E. Stein
DH - Eugene S. Domalski and Elizabeth D. Hearing
Quantity | Value | Units | Method | Reference | Comment |
---|---|---|---|---|---|
ΔfH°solid | -163.86 ± 0.37 | kcal/mol | Ccb | Huffman, Fox, et al., 1937 | Author's hf298=-165.54 kcal/mol; ALS |
Quantity | Value | Units | Method | Reference | Comment |
ΔcH°solid | -1058.34 ± 0.37 | kcal/mol | Ccb | Huffman, Fox, et al., 1937 | Author's hf298=-165.54 kcal/mol; ALS |
ΔcH°solid | -1071.2 | kcal/mol | Ccb | Emery and Benedict, 1911 | ALS |
Quantity | Value | Units | Method | Reference | Comment |
S°solid,1 bar | 51.150 | cal/mol*K | N/A | Cole, Hutchens, et al., 1963 | DH |
S°solid,1 bar | 53.01 | cal/mol*K | N/A | Huffman and Ellis, 1937 | Extrapolation below 90 K. 64.56 J/mol*K.; DH |
Constant pressure heat capacity of solid
Cp,solid (cal/mol*K) | Temperature (K) | Reference | Comment |
---|---|---|---|
51.730 | 298.15 | Cole, Hutchens, et al., 1963 | DH |
51.219 | 294.6 | Huffman and Ellis, 1937 | T = 87 to 295 K. Value is unsmoothed experimental datum.; DH |

Phase change data

Data compiled by: William E. Acree, Jr., James S. Chickos
Enthalpy of sublimation
ΔsubH (kcal/mol) | Temperature (K) | Method | Reference | Comment |
---|---|---|---|---|
24. ± 2. | 462. | LE | Gaffney, Pierce, et al., 1977 | Based on data from 412. to 512. K. |

Reaction thermochemistry data

Data compiled by: John E. Bartmess
Individual Reactions
By formula: C9H10NO3- + H+ = C9H11NO3
Quantity | Value | Units | Method | Reference | Comment |
---|---|---|---|---|---|
ΔrH° | 340.6 ± 1.8 | kcal/mol | G+TS | Tian, Wang, et al., 2009 | gas phase; Probes indicate 70% phenoxide, 30% carboxylate (0.5 kcal/mol). dSacid calc at B3LYP, mixture of anions |
ΔrH° | 337.7 ± 2.6 | kcal/mol | CIDC | Jones, Bernier, et al., 2007 | gas phase |
ΔrH° | 337.6 ± 3.1 | kcal/mol | G+TS | O'Hair, Bowie, et al., 1992 | gas phase |
Quantity | Value | Units | Method | Reference | Comment |
ΔrG° | 332.5 ± 1.5 | kcal/mol | N/A | Tian, Wang, et al., 2009 | gas phase; Probes indicate 70% phenoxide, 30% carboxylate (0.5 kcal/mol). dSacid calc at B3LYP, mixture of anions |
ΔrG° | 329.5 ± 3.0 | kcal/mol | CIDC | O'Hair, Bowie, et al., 1992 | gas phase |

Gas phase ion energetics data

Data evaluated as indicated in comments:
HL - Edward P. Hunter and Sharon G. Lias
Data compiled as indicated in comments:
B - John E. Bartmess
Quantity | Value | Units | Method | Reference | Comment |
---|---|---|---|---|---|
Proton affinity (review) | 221. | kcal/mol | N/A | Hunter and Lias, 1998 | HL |
Quantity | Value | Units | Method | Reference | Comment |
Gas basicity | 213.2 | kcal/mol | N/A | Hunter and Lias, 1998 | HL |
De-protonation reactions
By formula: C9H10NO3- + H+ = C9H11NO3
Quantity | Value | Units | Method | Reference | Comment |
---|---|---|---|---|---|
ΔrH° | 340.6 ± 1.8 | kcal/mol | G+TS | Tian, Wang, et al., 2009 | gas phase; Probes indicate 70% phenoxide, 30% carboxylate (0.5 kcal/mol). dSacid calc at B3LYP, mixture of anions; B |
ΔrH° | 337.7 ± 2.6 | kcal/mol | CIDC | Jones, Bernier, et al., 2007 | gas phase; B |
ΔrH° | 337.6 ± 3.1 | kcal/mol | G+TS | O'Hair, Bowie, et al., 1992 | gas phase; B |
Quantity | Value | Units | Method | Reference | Comment |
ΔrG° | 332.5 ± 1.5 | kcal/mol | N/A | Tian, Wang, et al., 2009 | gas phase; Probes indicate 70% phenoxide, 30% carboxylate (0.5 kcal/mol). dSacid calc at B3LYP, mixture of anions; B |
ΔrG° | 329.5 ± 3.0 | kcal/mol | CIDC | O'Hair, Bowie, et al., 1992 | gas phase; B |

References

Huffman, Fox, et al., 1937
Huffman, H.M.; Fox, S.W.; Ellis, E.L.,
Thermal data. VII. The heats of combustion of seven amino acids,
J. Am. Chem. Soc., 1937, 59, 2144-21. [all data]
Emery and Benedict, 1911
Emery, A.G.; Benedict, F.G.,
The heat of combustion of compounds of physiological importance,
Am. J. Physiol., 1911, 28, 301-307. [all data]
Cole, Hutchens, et al., 1963
Cole, A.G.; Hutchens, J.O.; Stout, J.W.,
Heat capacities from 11 to 305°K. and entropies of L-phenylalanine, L-proline, L-tryptophane, and L-tyrosine. Some free energies of formation,
J. Phys. Chem., 1963, 67, 1852-1855. [all data]
Huffman and Ellis, 1937
Huffman, H.M.; Ellis, E.L.,
Thermal data. VIII. The heat capacities, entropies and free energies of some amino acids,
J. Am. Chem. Soc., 1937, 59, 2150-2152. [all data]
Gaffney, Pierce, et al., 1977
Gaffney, Jeffrey S.; Pierce, Robert C.; Friedman, Lewis,
Mass spectrometer study of evaporation of .alpha.-amino acids,
J. Am. Chem. Soc., 1977, 99, 13, 4293-4298, https://doi.org/10.1021/ja00455a015
. [all data]
Tian, Wang, et al., 2009
Tian, Z.X.; Wang, X.B.; Wang, L.S.; Kass, S.R.,
Are Carboxyl Groups the Most Acidic Sites in Amino Acids? Gas-Phase Acidities, Photoelectron Spectra, and Computations on Tyrosine, p-Hydroxybenzoic Acid, and Their Conjugate Bases,
J. Am. Chem. Soc., 2009, 131, 3, 1174-1181, https://doi.org/10.1021/ja807982k
. [all data]
Jones, Bernier, et al., 2007
Jones, C.M.; Bernier, M.; Carson, E.; Colyer, K.E.; Metz, R.; Pawlow, A.; Wischow, E.D.; Webb, I.; Andriole, E.J.; Poutsma, J.C.,
Gas-phase Acities of the 20 Protein Amino Acids,
Int. J. Mass Spectrom., 2007, 267, 1-3, 54-62, https://doi.org/10.1016/j.ijms.2007.02.018
. [all data]
O'Hair, Bowie, et al., 1992
O'Hair, R.J.; Bowie, J.H.; Gronert, S.,
Gas Phase Acidity of the alpha-Amino Acids,
Int. J. Mass Spectrom. Ion Proc., 1992, 117, 23, https://doi.org/10.1016/0168-1176(92)80083-D
. [all data]
Hunter and Lias, 1998
Hunter, E.P.; Lias, S.G.,
Evaluated Gas Phase Basicities and Proton Affinities of Molecules: An Update,
J. Phys. Chem. Ref. Data, 1998, 27, 3, 413-656, https://doi.org/10.1063/1.556018
. [all data]
Lapinskaya and Khenokh, 1954
Lapinskaya, E.M.; Khenokh, M.A.,
Doklady Akad. Nauk S.S.S.R. (in Rus.), 1954, 94, 109. [all data]