(±)-6,10-dimethylundecan-2-one

Condensed phase thermochemistry data

Data compiled by: Hussein Y. Afeefy, Joel F. Liebman, and Stephen E. Stein

Quantity Value Units Method Reference Comment
Δfliquid-554.6 ± 1.1kJ/molCcbGadzhiev, Gubareva, et al., 1983Author's hf298_condensed=-556.72
Quantity Value Units Method Reference Comment
Δcliquid-8276.9 ± 5.2kJ/molCcbGadzhiev, Gubareva, et al., 1983Author's hf298_condensed=-556.72; Corresponding Δfliquid = -554.57 kJ/mol (simple calculation by NIST; no Washburn corrections)

References

Gadzhiev, Gubareva, et al., 1983
Gadzhiev, S.N.; Gubareva, A.I.; Ignat'ev, V.L.; Malinina, A.T.; Shakhova, M.K., Thermochemical study of intermediates from the synthesis of vitamin E, Deposited Document, SPSTL 448 Khp-D81. Chem. Abst. 98:88660x, 1983, 1. [all data]