Thiophene, tetrachloro-
- Formula: C4Cl4S
- Molecular weight: 221.920
- IUPAC Standard InChIKey: WZXXZHONLFRKGG-UHFFFAOYSA-N
- CAS Registry Number: 6012-97-1
- Chemical structure:
View 3d structure (requires JavaScript / HTML 5) - Other names: IF; IF (Fumigant); Pemphene; Penphene; Perchlorothiophene; Tetrachlorothiofene; 2,3,4,5-Tetrachlorothiophene; Tetrachlorothiophene; ENT 25,764; Penn salt td-183; Thiophene, 2,3,4,5-tetrachloro-; TCTP; TD-183; 2,3,4,5-Chlorothiophene; Tetrachlorthiofen; NSC 44615; NSC 61442

Phase change data

Data compiled by: Robert L. Brown and Stephen E. Stein
Reduced pressure boiling point
Tboil (K) | Pressure (bar) | Reference |
---|---|---|
349.2 | 0.003 | Weast and Grasselli, 1989 |

Gas phase ion energetics data

Data compiled by: Sharon G. Lias and Joel F. Liebman
Ionization energy determinations
IE (eV) | Method | Reference |
---|---|---|
8.80 | PE | Veszpremi, Nyulaszi, et al., 1988 |

References

Weast and Grasselli, 1989
CRC Handbook of Data on Organic Compounds, 2nd Editon, Weast,R.C and Grasselli, J.G., ed(s)., CRC Press, Inc., Boca Raton, FL, 1989, 1. [all data]