Benzenamine, N,N-dimethyl-4-(phenylazo)-

Condensed phase thermochemistry data

Data compiled by: Hussein Y. Afeefy, Joel F. Liebman, and Stephen E. Stein

Quantity Value Units Method Reference Comment
Δfsolid80.5kcal/molCcbLemoult, 1908
Quantity Value Units Method Reference Comment
Δcsolid-1909.6kcal/molCcbLemoult, 1908

Phase change data

Data compiled as indicated in comments:
TRC - Thermodynamics Research Center, NIST Boulder Laboratories, Chris Muzny director
AC - William E. Acree, Jr., James S. Chickos

Quantity Value Units Method Reference Comment
Tfus389.KN/ABaughman and Perenich, 1988Uncertainty assigned by TRC = 1. K; TRC

Enthalpy of sublimation

ΔsubH (kcal/mol) Temperature (K) Method Reference Comment
28.11 ± 0.41350.MEGreen and Jones, 1967Based on data from 346. - 354. K.; AC
27.70 ± 0.31353.TEGreen and Jones, 1967Based on data from 352. - 354. K.; AC
28.90 ± 0.41373.MEMajury, 1956See also Stephenson and Malanowski, 1987.; AC

In addition to the Thermodynamics Research Center (TRC) data available from this site, much more physical and chemical property data is available from the following TRC products:

References

Lemoult, 1908
Lemoult, M.P., Recherches theoriques et experimentales sur les chaleurs de combustion et de formation des composes organiques, Ann. Chim. Phys., 1908, 14, 289-310. [all data]

Baughman and Perenich, 1988
Baughman, G.L.; Perenich, T.A., Fate of dyes in aquatic systems: I. Solubility and partitioning of some hydrophobic dyes and related compounds, Environ. Tox. Chem., 1988, 7, 3, 183, https://doi.org/10.1002/etc.5620070302 . [all data]

Green and Jones, 1967
Green, H.S.; Jones, F., Vapour pressures, heats of sublimation and degrees of association of some azo compounds in the vapour phase, Trans. Faraday Soc., 1967, 63, 1612, https://doi.org/10.1039/tf9676301612 . [all data]

Majury, 1956
Majury, T.G., Chem. Ind., 1956, 17, 349. [all data]

Stephenson and Malanowski, 1987
Stephenson, Richard M.; Malanowski, Stanislaw, Handbook of the Thermodynamics of Organic Compounds, 1987, https://doi.org/10.1007/978-94-009-3173-2 . [all data]