Benzenamine, 4-(phenylazo)-
- Formula: C12H11N3
- Molecular weight: 197.2358
- IUPAC Standard InChIKey: QPQKUYVSJWQSDY-UHFFFAOYSA-N
- CAS Registry Number: 60-09-3
- Chemical structure:
View 3d structure (requires JavaScript / HTML 5) - Stereoisomers:
- Other names: C.I. Solvent Yellow 1; p-(Phenylazo)aniline; p-Aminoazobenzene; p-Aminoazobenzol; p-Aminodiphenyldiimide; Aniline Yellow; Brasilazina Oil Yellow G; C.I. 11000; Cellitazol R; Ceres Yellow R; Fast Spirit Yellow; Fat Yellow AAB; Induline R; Oil Soluble Aniline Yellow; Oil Yellow AAB; Oil Yellow AB; Oil Yellow AN; Oil Yellow B; Organol Yellow 2A; Solvent Yellow 1; Somalia Yellow 2G; Sudan Yellow R; 4-Aminoazobenzene; 4-Aminoazobenzol; 4-Phenylazoaniline; p-(Phenolazo)aniline; p-(Phenylazo)phenylamine; p-Amimoazobenzene; Aminoazobenzene; Aniline, p-(phenylazo)-; Azobenzene, 4-amino-; C.I. Solvent Blue 7; Fast Spirit Yellow AAB; Oil Yellow R; Oil Yellow 2G; Oil-Sol. Aniline Yellow; Organol Yellow; Stearix Brown 4R; Sudan Yellow RA; USAF EK-1375; 4-(Phenylazo)benzenamine; 4-Amino-1,1'-azobenzene; 4-Benzeneazoaniline; Paraphenolazo aniline; Zlut anilinova; Zlut rozpoustedlova 1; Benzenamine, 4-(2-phenyldiazenyl)-; p-Aminodiphenylimide

Condensed phase thermochemistry data

Data compiled as indicated in comments:
ALS - Hussein Y. Afeefy, Joel F. Liebman, and Stephen E. Stein
DH - Eugene S. Domalski and Elizabeth D. Hearing
Quantity | Value | Units | Method | Reference | Comment |
---|---|---|---|---|---|
ΔfH°solid | 323. | kJ/mol | Ccb | Lemoult, 1908 | ALS |
Quantity | Value | Units | Method | Reference | Comment |
ΔcH°solid | -6617.4 | kJ/mol | Ccb | Lemoult, 1908 | ALS |
Constant pressure heat capacity of solid
Cp,solid (J/mol*K) | Temperature (K) | Reference | Comment |
---|---|---|---|
276.1 | 323. | Satoh and Sogabe, 1941 | T = 0 to 100°C. Mean value.; DH |

Phase change data

Data compiled as indicated in comments:
BS - Robert L. Brown and Stephen E. Stein
TRC - Thermodynamics Research Center, NIST Boulder Laboratories, Chris Muzny director
AC - William E. Acree, Jr., James S. Chickos
Quantity | Value | Units | Method | Reference | Comment |
---|---|---|---|---|---|
Tboil | 633. | K | N/A | Buckingham and Donaghy, 1982 | BS |
Quantity | Value | Units | Method | Reference | Comment |
Tfus | 398. | K | N/A | Baughman and Perenich, 1988 | Uncertainty assigned by TRC = 1. K; TRC |
Tfus | 399. | K | N/A | Buckingham and Donaghy, 1982 | BS |
Enthalpy of sublimation
ΔsubH (kJ/mol) | Temperature (K) | Method | Reference | Comment |
---|---|---|---|---|
110.9 ± 1.7 | 364. | ME | Majury, 1956 | Based on data from 356. to 373. K. See also Stephenson and Malanowski, 1987.; AC |
Enthalpy of fusion
ΔfusH (kJ/mol) | Temperature (K) | Reference | Comment |
---|---|---|---|
21.7 | 398.2 | Baughman and Perenich, 1988, 2 | AC |

References

Lemoult, 1908
Lemoult, M.P.,
Recherches theoriques et experimentales sur les chaleurs de combustion et de formation des composes organiques,
Ann. Chim. Phys., 1908, 14, 289-310. [all data]
Satoh and Sogabe, 1941
Satoh, S.; Sogabe, T.,
The heat capacities of some organic compounds containing nitrogen and the atomic heat of nitrogen. (2), Sci.,
Pap. Inst. Phys. Chem. Res. (Tokyo), 1941, 38, 231-237. [all data]
Buckingham and Donaghy, 1982
Buckingham, J.; Donaghy, S.M.,
Dictionary of Organic Compounds: Fifth Edition, Chapman and Hall, New York, 1982, 1. [all data]
Baughman and Perenich, 1988
Baughman, G.L.; Perenich, T.A.,
Fate of dyes in aquatic systems: I. Solubility and partitioning of some hydrophobic dyes and related compounds,
Environ. Tox. Chem., 1988, 7, 3, 183, https://doi.org/10.1002/etc.5620070302
. [all data]
Majury, 1956
Majury, T.G.,
Chem. Ind., 1956, 17, 349. [all data]
Stephenson and Malanowski, 1987
Stephenson, Richard M.; Malanowski, Stanislaw,
Handbook of the Thermodynamics of Organic Compounds, 1987, https://doi.org/10.1007/978-94-009-3173-2
. [all data]
Baughman and Perenich, 1988, 2
Baughman, George L.; Perenich, Theresa A.,
Fate of dyes in aquatic systems: I. Solubility and partitioning of some hydrophobic dyes and related compounds,
Environ Toxicol Chem, 1988, 7, 3, 183-199, https://doi.org/10.1002/etc.5620070302
. [all data]
Dahn and Castelmur, 1953
Dahn, H.; Castelmur, H.,
Uber die absorptionsspektren von polyazoverbindungen,
Helv. Chim. Acta, 1953, 36, 638-645. [all data]